BDBM4647 Anilinoquinazoline deriv. 30::N-(4-chloro-2-fluorophenyl)-6-methoxy-7-[2-(1H-1,2,3-triazol-1-yl)ethoxy]quinazolin-4-amine
SMILES: COc1cc2c(Nc3ccc(Cl)cc3F)ncnc2cc1OCCn1ccnn1
InChI Key: InChIKey=ZDUNROKMXDSWQP-UHFFFAOYSA-N
Data: 3 IC50
Activity Spreadsheet -- Enzyme Inhibition Constant Data from BindingDB
Found 3 hits for monomerid = 4647
Trg + Lig
Ki
nM
ΔG°
kcal/mole
IC50
nM
Kd
nM
EC50/IC50
nM
koff
s-1
kon
M-1s-1
pHTemp
°C
Vascular endothelial growth factor receptor 1
(Homo sapiens (Human))
BDBM4647
(Anilinoquinazoline deriv. 30 | N-(4-chloro-2-fluor...)
Show SMILES COc1cc2c(Nc3ccc(Cl)cc3F)ncnc2cc1OCCn1ccnn1
Show InChI InChI=1S/C19H16ClFN6O2/c1-28-17-9-13-16(10-18(17)29-7-6-27-5-4-24-26-27)22-11-23-19(13)25-15-3-2-12(20)8-14(15)21/h2-5,8-11H,6-7H2,1H3,(H,22,23,25)
n/an/a 300n/an/an/an/an/a25
AstraZeneca
Assay Description
An ELISA assay was used to determine the ability of inhibitor to inhibit VEGF-R RTK activity. The compounds were incubated with enzyme 20 min at room...
J Med Chem 42: 5369-89 (1999)
Article DOI: 10.1021/jm990345w
BindingDB Entry DOI: 10.7270/Q2F47MBM
Fibroblast growth factor receptor 1
(Homo sapiens (Human))
BDBM4647
(Anilinoquinazoline deriv. 30 | N-(4-chloro-2-fluor...)
Show SMILES COc1cc2c(Nc3ccc(Cl)cc3F)ncnc2cc1OCCn1ccnn1
Show InChI InChI=1S/C19H16ClFN6O2/c1-28-17-9-13-16(10-18(17)29-7-6-27-5-4-24-26-27)22-11-23-19(13)25-15-3-2-12(20)8-14(15)21/h2-5,8-11H,6-7H2,1H3,(H,22,23,25)
NCI pathway
Reactome pathway
n/an/a 1.80E+3n/an/an/an/an/a25
AstraZeneca
Assay Description
An ELISA assay was used to determine the ability of inhibitor to inhibit FGFR-1 TK activity. The compounds were incubated with enzyme 20 min at room ...
J Med Chem 42: 5369-89 (1999)
Article DOI: 10.1021/jm990345w
BindingDB Entry DOI: 10.7270/Q2F47MBM
Vascular endothelial growth factor receptor 2
(Homo sapiens (Human))
BDBM4647
(Anilinoquinazoline deriv. 30 | N-(4-chloro-2-fluor...)
Show SMILES COc1cc2c(Nc3ccc(Cl)cc3F)ncnc2cc1OCCn1ccnn1
Show InChI InChI=1S/C19H16ClFN6O2/c1-28-17-9-13-16(10-18(17)29-7-6-27-5-4-24-26-27)22-11-23-19(13)25-15-3-2-12(20)8-14(15)21/h2-5,8-11H,6-7H2,1H3,(H,22,23,25)
NCI pathway
Reactome pathway
n/an/a 10n/an/an/an/an/a25
AstraZeneca
Assay Description
An ELISA assay was used to determine the ability of inhibitor to inhibit VEGF-R RTK activity. The compounds were incubated with enzyme 20 min at room...
J Med Chem 42: 5369-89 (1999)
Article DOI: 10.1021/jm990345w
BindingDB Entry DOI: 10.7270/Q2F47MBM