BDBM4652 Anilinoquinazoline deriv. 35::N-(4-bromo-2,6-difluorophenyl)-6-methoxy-7-[2-(1H-1,2,3-triazol-1-yl)ethoxy]quinazolin-4-amine
SMILES: COc1cc2c(Nc3c(F)cc(Br)cc3F)ncnc2cc1OCCn1ccnn1
InChI Key: InChIKey=SAZIXFAROZCPDO-UHFFFAOYSA-N
Data: 3 IC50
Activity Spreadsheet -- Enzyme Inhibition Constant Data from BindingDB
Found 3 hits for monomerid = 4652
Trg + Lig
Ki
nM
ΔG°
kcal/mole
IC50
nM
Kd
nM
EC50/IC50
nM
koff
s-1
kon
M-1s-1
pHTemp
°C
Vascular endothelial growth factor receptor 1
(Homo sapiens (Human))
BDBM4652
(Anilinoquinazoline deriv. 35 | N-(4-bromo-2,6-difl...)
Show SMILES COc1cc2c(Nc3c(F)cc(Br)cc3F)ncnc2cc1OCCn1ccnn1
Show InChI InChI=1S/C19H15BrF2N6O2/c1-29-16-8-12-15(9-17(16)30-5-4-28-3-2-25-27-28)23-10-24-19(12)26-18-13(21)6-11(20)7-14(18)22/h2-3,6-10H,4-5H2,1H3,(H,23,24,26)
n/an/a 800n/an/an/an/an/a25
AstraZeneca
Assay Description
An ELISA assay was used to determine the ability of inhibitor to inhibit VEGF-R RTK activity. The compounds were incubated with enzyme 20 min at room...
J Med Chem 42: 5369-89 (1999)
Article DOI: 10.1021/jm990345w
BindingDB Entry DOI: 10.7270/Q2F47MBM
Fibroblast growth factor receptor 1
(Homo sapiens (Human))
BDBM4652
(Anilinoquinazoline deriv. 35 | N-(4-bromo-2,6-difl...)
Show SMILES COc1cc2c(Nc3c(F)cc(Br)cc3F)ncnc2cc1OCCn1ccnn1
Show InChI InChI=1S/C19H15BrF2N6O2/c1-29-16-8-12-15(9-17(16)30-5-4-28-3-2-25-27-28)23-10-24-19(12)26-18-13(21)6-11(20)7-14(18)22/h2-3,6-10H,4-5H2,1H3,(H,23,24,26)
NCI pathway
Reactome pathway
n/an/a 6.10E+3n/an/an/an/an/a25
AstraZeneca
Assay Description
An ELISA assay was used to determine the ability of inhibitor to inhibit FGFR-1 TK activity. The compounds were incubated with enzyme 20 min at room ...
J Med Chem 42: 5369-89 (1999)
Article DOI: 10.1021/jm990345w
BindingDB Entry DOI: 10.7270/Q2F47MBM
Vascular endothelial growth factor receptor 2
(Homo sapiens (Human))
BDBM4652
(Anilinoquinazoline deriv. 35 | N-(4-bromo-2,6-difl...)
Show SMILES COc1cc2c(Nc3c(F)cc(Br)cc3F)ncnc2cc1OCCn1ccnn1
Show InChI InChI=1S/C19H15BrF2N6O2/c1-29-16-8-12-15(9-17(16)30-5-4-28-3-2-25-27-28)23-10-24-19(12)26-18-13(21)6-11(20)7-14(18)22/h2-3,6-10H,4-5H2,1H3,(H,23,24,26)
NCI pathway
Reactome pathway
n/an/a 40n/an/an/an/an/a25
AstraZeneca
Assay Description
An ELISA assay was used to determine the ability of inhibitor to inhibit VEGF-R RTK activity. The compounds were incubated with enzyme 20 min at room...
J Med Chem 42: 5369-89 (1999)
Article DOI: 10.1021/jm990345w
BindingDB Entry DOI: 10.7270/Q2F47MBM