BDBM46563 4-chloranyl-N-[1-(phenylmethyl)pyrrolo[3,2-b]quinoxalin-2-yl]benzenesulfonamide::4-chloro-N-[1-(phenylmethyl)-2-pyrrolo[3,2-b]quinoxalinyl]benzenesulfonamide::MLS000580954::N-(1-Benzyl-1H-pyrrolo[2,3-b]quinoxalin-2-yl)-4-chloro-benzenesulfonamide::N-(1-benzylpyrrolo[3,2-b]quinoxalin-2-yl)-4-chloro-benzenesulfonamide::N-(1-benzylpyrrolo[3,2-b]quinoxalin-2-yl)-4-chlorobenzenesulfonamide::SMR000220389::cid_2044030
SMILES: Clc1ccc(cc1)S(=O)(=O)Nc1cc2nc3ccccc3nc2n1Cc1ccccc1
InChI Key: InChIKey=QRNHZTGFJGPYFW-UHFFFAOYSA-N
Data: 9 IC50  1 EC50
Activity Spreadsheet -- Enzyme Inhibition Constant Data from BindingDB
Found 10 hits for monomerid = 46563
Trg + Lig
Ki
nM
ΔG°
kcal/mole
IC50
nM
Kd
nM
EC50/IC50
nM
koff
s-1
kon
M-1s-1
pHTemp
°C
Valosin-containing protein
(Homo sapiens (Human))
BDBM46563
(4-chloranyl-N-[1-(phenylmethyl)pyrrolo[3,2-b]quino...)
Show SMILES Clc1ccc(cc1)S(=O)(=O)Nc1cc2nc3ccccc3nc2n1Cc1ccccc1
Show InChI InChI=1S/C23H17ClN4O2S/c24-17-10-12-18(13-11-17)31(29,30)27-22-14-21-23(26-20-9-5-4-8-19(20)25-21)28(22)15-16-6-2-1-3-7-16/h1-14,27H,15H2
PCBioAssay
n/an/a>5.00E+4n/an/an/an/an/an/a
The Scripps Research Institute Molecular Screening Center
Curated by PubChem BioAssay
Assay Description
Source (MLPCN Center Name): The Scripps Research Institute Molecular Screening Center Center Affiliation: The Scripps Research Institute (TSRI) Assay...
PubChem Bioassay (2009)
BindingDB Entry DOI: 10.7270/Q2513WMG
Valosin-containing protein
(Homo sapiens (Human))
BDBM46563
(4-chloranyl-N-[1-(phenylmethyl)pyrrolo[3,2-b]quino...)
Show SMILES Clc1ccc(cc1)S(=O)(=O)Nc1cc2nc3ccccc3nc2n1Cc1ccccc1
Show InChI InChI=1S/C23H17ClN4O2S/c24-17-10-12-18(13-11-17)31(29,30)27-22-14-21-23(26-20-9-5-4-8-19(20)25-21)28(22)15-16-6-2-1-3-7-16/h1-14,27H,15H2
PCBioAssay
n/an/a>5.00E+4n/an/an/an/an/an/a
The Scripps Research Institute Molecular Screening Center
Curated by PubChem BioAssay
Assay Description
Source (MLPCN Center Name): The Scripps Research Institute Molecular Screening Center Center Affiliation: The Scripps Research Institute (TSRI) Assay...
PubChem Bioassay (2009)
BindingDB Entry DOI: 10.7270/Q2P26WJQ
BZLF2
(Human herpesvirus 4 type 2)
BDBM46563
(4-chloranyl-N-[1-(phenylmethyl)pyrrolo[3,2-b]quino...)
Show SMILES Clc1ccc(cc1)S(=O)(=O)Nc1cc2nc3ccccc3nc2n1Cc1ccccc1
Show InChI InChI=1S/C23H17ClN4O2S/c24-17-10-12-18(13-11-17)31(29,30)27-22-14-21-23(26-20-9-5-4-8-19(20)25-21)28(22)15-16-6-2-1-3-7-16/h1-14,27H,15H2
PCBioAssay
n/an/a 3.15E+3n/an/an/an/an/an/a
Emory University Molecular Libraries Screening Center
Curated by PubChem BioAssay
Assay Description
NIH Molecular Libraries Screening Centers Network [MLSCN] Emory Chemical Biology Discovery Center in MLSCN Assay provider: Theodore Jardetzky; Northw...
PubChem Bioassay (2008)
BindingDB Entry DOI: 10.7270/Q2057DCW
plectin 1
(Homo sapiens (Human))
BDBM46563
(4-chloranyl-N-[1-(phenylmethyl)pyrrolo[3,2-b]quino...)
Show SMILES Clc1ccc(cc1)S(=O)(=O)Nc1cc2nc3ccccc3nc2n1Cc1ccccc1
Show InChI InChI=1S/C23H17ClN4O2S/c24-17-10-12-18(13-11-17)31(29,30)27-22-14-21-23(26-20-9-5-4-8-19(20)25-21)28(22)15-16-6-2-1-3-7-16/h1-14,27H,15H2
Reactome pathway
PCBioAssay
n/an/a 6.05E+3n/an/an/an/an/an/a
Burnham Center for Chemical Genomics
Curated by PubChem BioAssay
Assay Description
Data Source: Sanford-Burnham Center for Chemical Genomics (SBCCG) Source Affiliation: Sanford-Burnham Medical Research Institute (SBMRI, San Diego, C...
PubChem Bioassay (2009)
BindingDB Entry DOI: 10.7270/Q2V1236D
tyrosyl-DNA phosphodiesterase 2
(Homo sapiens (Human))
BDBM46563
(4-chloranyl-N-[1-(phenylmethyl)pyrrolo[3,2-b]quino...)
Show SMILES Clc1ccc(cc1)S(=O)(=O)Nc1cc2nc3ccccc3nc2n1Cc1ccccc1
Show InChI InChI=1S/C23H17ClN4O2S/c24-17-10-12-18(13-11-17)31(29,30)27-22-14-21-23(26-20-9-5-4-8-19(20)25-21)28(22)15-16-6-2-1-3-7-16/h1-14,27H,15H2
PCBioAssay
n/an/a 1.43E+4n/an/an/an/an/an/a
The Scripps Research Institute Molecular Screening Center
Curated by PubChem BioAssay
Assay Description
Source (MLPCN Center Name): The Scripps Research Institute Molecular Screening Center (SRIMSC) Center Affiliation: The Scripps Research Institute (TS...
PubChem Bioassay (2014)
BindingDB Entry DOI: 10.7270/Q2WS8RXV
Hsf1 protein
(Mus musculus)
BDBM46563
(4-chloranyl-N-[1-(phenylmethyl)pyrrolo[3,2-b]quino...)
Show SMILES Clc1ccc(cc1)S(=O)(=O)Nc1cc2nc3ccccc3nc2n1Cc1ccccc1
Show InChI InChI=1S/C23H17ClN4O2S/c24-17-10-12-18(13-11-17)31(29,30)27-22-14-21-23(26-20-9-5-4-8-19(20)25-21)28(22)15-16-6-2-1-3-7-16/h1-14,27H,15H2
PCBioAssay
n/an/an/an/a>2.60E+5n/an/an/an/a
Broad Institute
Curated by PubChem BioAssay
Assay Description
Keywords: Heat Shock Factor-1 (HSF-1), Stress Response, MG132, NIH3T3, Luminescence Assay Overview: Confirmation testing of small molecules identifie...
PubChem Bioassay (2010)
BindingDB Entry DOI: 10.7270/Q2P55KXK
Tyrosine-protein kinase ABL1
(Homo sapiens (Human))
BDBM46563
(4-chloranyl-N-[1-(phenylmethyl)pyrrolo[3,2-b]quino...)
Show SMILES Clc1ccc(cc1)S(=O)(=O)Nc1cc2nc3ccccc3nc2n1Cc1ccccc1
Show InChI InChI=1S/C23H17ClN4O2S/c24-17-10-12-18(13-11-17)31(29,30)27-22-14-21-23(26-20-9-5-4-8-19(20)25-21)28(22)15-16-6-2-1-3-7-16/h1-14,27H,15H2
Reactome pathway
PCBioAssay
n/an/a>7.35E+4n/an/an/an/an/an/a
The Scripps Research Institute Molecular Screening Center
Curated by PubChem BioAssay
Assay Description
Source (MLPCN Center Name): The Scripps Research Institute Molecular Screening Center (SRIMSC) Affiliation: The Scripps Research Institute, TSRI Assa...
PubChem Bioassay (2012)
BindingDB Entry DOI: 10.7270/Q2RB736G
methionyl-tRNA synthetase
(Trypanosoma brucei brucei strain 927/4 GUTat10.1)
BDBM46563
(4-chloranyl-N-[1-(phenylmethyl)pyrrolo[3,2-b]quino...)
Show SMILES Clc1ccc(cc1)S(=O)(=O)Nc1cc2nc3ccccc3nc2n1Cc1ccccc1
Show InChI InChI=1S/C23H17ClN4O2S/c24-17-10-12-18(13-11-17)31(29,30)27-22-14-21-23(26-20-9-5-4-8-19(20)25-21)28(22)15-16-6-2-1-3-7-16/h1-14,27H,15H2
PCBioAssay
n/an/a 2.46E+3n/an/an/an/an/an/a
The Scripps Research Institute Molecular Screening Center
Curated by PubChem BioAssay
PubChem Bioassay (2013)
BindingDB Entry DOI: 10.7270/Q2XP73JZ
Methyl-CpG binding domain protein 2
(Homo sapiens (Human))
BDBM46563
(4-chloranyl-N-[1-(phenylmethyl)pyrrolo[3,2-b]quino...)
Show SMILES Clc1ccc(cc1)S(=O)(=O)Nc1cc2nc3ccccc3nc2n1Cc1ccccc1
Show InChI InChI=1S/C23H17ClN4O2S/c24-17-10-12-18(13-11-17)31(29,30)27-22-14-21-23(26-20-9-5-4-8-19(20)25-21)28(22)15-16-6-2-1-3-7-16/h1-14,27H,15H2
Reactome pathway
PCBioAssay
n/an/a 4.38E+4n/an/an/an/an/an/a
The Scripps Research Institute Molecular Screening Center
Curated by PubChem BioAssay
Assay Description
Source (MLPCN Center Name): The Scripps Research Institute Molecular Screening Center Affiliation: The Scripps Research Institute, TSRI Assay Provide...
PubChem Bioassay (2013)
BindingDB Entry DOI: 10.7270/Q20K2778
plectin 1
(Homo sapiens (Human))
BDBM46563
(4-chloranyl-N-[1-(phenylmethyl)pyrrolo[3,2-b]quino...)
Show SMILES Clc1ccc(cc1)S(=O)(=O)Nc1cc2nc3ccccc3nc2n1Cc1ccccc1
Show InChI InChI=1S/C23H17ClN4O2S/c24-17-10-12-18(13-11-17)31(29,30)27-22-14-21-23(26-20-9-5-4-8-19(20)25-21)28(22)15-16-6-2-1-3-7-16/h1-14,27H,15H2
Reactome pathway
PCBioAssay
n/an/a 2.00E+5n/an/an/an/an/an/a
Burnham Center for Chemical Genomics
Curated by PubChem BioAssay
Assay Description
Data Source: Sanford-Burnham Center for Chemical Genomics (SBCCG) Source Affiliation: Sanford-Burnham Medical Research Institute (SBMRI, San Diego, C...
PubChem Bioassay (2009)
BindingDB Entry DOI: 10.7270/Q2QZ28D7