BDBM46819 1-azepanyl-[2-(4-fluorophenyl)sulfonyl-3,4-dihydro-1H-isoquinolin-3-yl]methanone::Azepan-1-yl-[2-(4-fluoro-benzenesulfonyl)-1,2,3,4-tetrahydro-isoquinolin-3-yl]-methanone::MLS000077046::SMR000010880::azepan-1-yl-[2-(4-fluorophenyl)sulfonyl-3,4-dihydro-1H-isoquinolin-3-yl]methanone::cid_647346
SMILES: Fc1ccc(cc1)S(=O)(=O)N1Cc2ccccc2CC1C(=O)N1CCCCCC1
InChI Key: InChIKey=OBSVLXUYRICTAK-UHFFFAOYSA-N
Data: 2 EC50
Activity Spreadsheet -- Enzyme Inhibition Constant Data from BindingDB
Found 2 hits for monomerid = 46819
Trg + Lig
Ki
nM
ΔG°
kcal/mole
IC50
nM
Kd
nM
EC50/IC50
nM
koff
s-1
kon
M-1s-1
pHTemp
°C
transient receptor potential cation channel, subfamily N, member 1
(Danio rerio)
BDBM46819
(1-azepanyl-[2-(4-fluorophenyl)sulfonyl-3,4-dihydro...)
Show SMILES Fc1ccc(cc1)S(=O)(=O)N1Cc2ccccc2CC1C(=O)N1CCCCCC1
Show InChI InChI=1S/C22H25FN2O3S/c23-19-9-11-20(12-10-19)29(27,28)25-16-18-8-4-3-7-17(18)15-21(25)22(26)24-13-5-1-2-6-14-24/h3-4,7-12,21H,1-2,5-6,13-16H2
PCBioAssay
n/an/an/an/a 2.99E+4n/an/an/an/a
The Scripps Research Institute Molecular Screening Center
Curated by PubChem BioAssay
Assay Description
Source (MLPCN Center Name): The Scripps Research Institute Molecular Screening Center (SRIMSC) Center Affiliation: The Scripps Research Institute (TS...
PubChem Bioassay (2009)
BindingDB Entry DOI: 10.7270/Q2Z60MG3
MCOLN3 protein
(Homo sapiens (Human))
BDBM46819
(1-azepanyl-[2-(4-fluorophenyl)sulfonyl-3,4-dihydro...)
Show SMILES Fc1ccc(cc1)S(=O)(=O)N1Cc2ccccc2CC1C(=O)N1CCCCCC1
Show InChI InChI=1S/C22H25FN2O3S/c23-19-9-11-20(12-10-19)29(27,28)25-16-18-8-4-3-7-17(18)15-21(25)22(26)24-13-5-1-2-6-14-24/h3-4,7-12,21H,1-2,5-6,13-16H2
PCBioAssay
n/an/an/an/a 3.72E+3n/an/an/an/a
The Scripps Research Institute Molecular Screening Center
Curated by PubChem BioAssay
Assay Description
Source (MLPCN Center Name): The Scripps Research Institute Molecular Screening Center (SRIMSC) Center Affiliation: The Scripps Research Institute (TS...
PubChem Bioassay (2009)
BindingDB Entry DOI: 10.7270/Q21834W4