null
SMILES: CC1=CC(C)(C)N(C(=O)CSc2nnc(o2)-c2ccccc2)c2ccc(C)cc12
InChI Key: InChIKey=AYQGFKIZSAKEBZ-UHFFFAOYSA-N
Activity Spreadsheet -- Enzyme Inhibition Constant Data from BindingDB
Found 2 hits for monomerid = 46855
Trg + Lig
Ki
nM
ΔG°
kcal/mole
IC50
nM
Kd
nM
EC50/IC50
nM
koff
s-1
kon
M-1s-1
pHTemp
°C
Ion channel NompC
(Danio rerio)
BDBM46855
(2-[(5-phenyl-1,3,4-oxadiazol-2-yl)sulfanyl]-1-(2,2...)
Show SMILES CC1=CC(C)(C)N(C(=O)CSc2nnc(o2)-c2ccccc2)c2ccc(C)cc12 |t:1|
Show InChI InChI=1S/C23H23N3O2S/c1-15-10-11-19-18(12-15)16(2)13-23(3,4)26(19)20(27)14-29-22-25-24-21(28-22)17-8-6-5-7-9-17/h5-13H,14H2,1-4H3
PCBioAssay
n/an/an/an/a 2.99E+4n/an/an/an/a
The Scripps Research Institute Molecular Screening Center
Curated by PubChem BioAssay
Assay Description
Source (MLPCN Center Name): The Scripps Research Institute Molecular Screening Center (SRIMSC) Center Affiliation: The Scripps Research Institute (TS...
PubChem Bioassay (2009)
BindingDB Entry DOI: 10.7270/Q2Z60MG3
Mucolipin-3
(Homo sapiens (Human))
BDBM46855
(2-[(5-phenyl-1,3,4-oxadiazol-2-yl)sulfanyl]-1-(2,2...)
Show SMILES CC1=CC(C)(C)N(C(=O)CSc2nnc(o2)-c2ccccc2)c2ccc(C)cc12 |t:1|
Show InChI InChI=1S/C23H23N3O2S/c1-15-10-11-19-18(12-15)16(2)13-23(3,4)26(19)20(27)14-29-22-25-24-21(28-22)17-8-6-5-7-9-17/h5-13H,14H2,1-4H3
PCBioAssay
n/an/an/an/a 4.18E+3n/an/an/an/a
The Scripps Research Institute Molecular Screening Center
Curated by PubChem BioAssay
Assay Description
Source (MLPCN Center Name): The Scripps Research Institute Molecular Screening Center (SRIMSC) Center Affiliation: The Scripps Research Institute (TS...
PubChem Bioassay (2009)
BindingDB Entry DOI: 10.7270/Q21834W4