BDBM469 CHEMBL2110206::Dihydropyran-2-one deriv. 74::N-(5-tert-butyl-4-{[(6S)-4-hydroxy-2-oxo-6-(2-phenylethyl)-6-(propan-2-yl)-5,6-dihydro-2H-pyran-3-yl]sulfanyl}-2-methylphenyl)-4-cyanobenzene-1-sulfonamide
SMILES: CC(C)[C@]1(CCc2ccccc2)CC(=O)C(Sc2cc(C)c(NS(=O)(=O)c3ccc(cc3)C#N)cc2C(C)(C)C)C(=O)O1
InChI Key: InChIKey=IBLLFFDTKYKCIH-AEHIRBQFSA-N
Data: 2 KI  1 IC50
Activity Spreadsheet -- Enzyme Inhibition Constant Data from BindingDB
Found 3 hits for monomerid = 469
Trg + Lig
Ki
nM
ΔG°
kcal/mole
IC50
nM
Kd
nM
EC50/IC50
nM
koff
s-1
kon
M-1s-1
pHTemp
°C
HIV-1 Protease
(Human immunodeficiency virus type 1)
BDBM469
(CHEMBL2110206 | Dihydropyran-2-one deriv. 74 | N-(...)
Show SMILES CC(C)[C@]1(CCc2ccccc2)CC(=O)C(Sc2cc(C)c(NS(=O)(=O)c3ccc(cc3)C#N)cc2C(C)(C)C)C(=O)O1 |r|
Show InChI InChI=1S/C34H38N2O5S2/c1-22(2)34(17-16-24-10-8-7-9-11-24)20-29(37)31(32(38)41-34)42-30-18-23(3)28(19-27(30)33(4,5)6)36-43(39,40)26-14-12-25(21-35)13-15-26/h7-15,18-19,22,31,36H,16-17,20H2,1-6H3/t31?,34-/m0/s1
0.200n/an/an/an/an/an/an/an/a
Parke-Davis Pharmaceutical Research
Assay Description
Sensitivity of HIV-1 protease activity to protease inhibitors was determined by a peptide substrate cleavage assay. Protease products were analyzed o...
J Med Chem 43: 843-58 (2000)
Article DOI: 10.1021/jm990281p
BindingDB Entry DOI: 10.7270/Q21N7Z9R
Human immunodeficiency virus type 1 protease
(Human immunodeficiency virus type 1)
BDBM469
(CHEMBL2110206 | Dihydropyran-2-one deriv. 74 | N-(...)
Show SMILES CC(C)[C@]1(CCc2ccccc2)CC(=O)C(Sc2cc(C)c(NS(=O)(=O)c3ccc(cc3)C#N)cc2C(C)(C)C)C(=O)O1 |r|
Show InChI InChI=1S/C34H38N2O5S2/c1-22(2)34(17-16-24-10-8-7-9-11-24)20-29(37)31(32(38)41-34)42-30-18-23(3)28(19-27(30)33(4,5)6)36-43(39,40)26-14-12-25(21-35)13-15-26/h7-15,18-19,22,31,36H,16-17,20H2,1-6H3/t31?,34-/m0/s1
0.200n/an/an/an/an/an/an/an/a
Parke-Davis Pharmaceutical Research
Assay Description
Tested for binding affinity against HIV protease
J Med Chem 43: 843-58 (2000)
Article DOI: 10.1021/jm990281p
BindingDB Entry DOI: 10.7270/Q21N7Z9R
Human immunodeficiency virus type 1 protease
(Human immunodeficiency virus type 1)
BDBM469
(CHEMBL2110206 | Dihydropyran-2-one deriv. 74 | N-(...)
Show SMILES CC(C)[C@]1(CCc2ccccc2)CC(=O)C(Sc2cc(C)c(NS(=O)(=O)c3ccc(cc3)C#N)cc2C(C)(C)C)C(=O)O1 |r|
Show InChI InChI=1S/C34H38N2O5S2/c1-22(2)34(17-16-24-10-8-7-9-11-24)20-29(37)31(32(38)41-34)42-30-18-23(3)28(19-27(30)33(4,5)6)36-43(39,40)26-14-12-25(21-35)13-15-26/h7-15,18-19,22,31,36H,16-17,20H2,1-6H3/t31?,34-/m0/s1
n/an/a 9.10n/an/an/an/an/an/a
Parke-Davis Pharmaceutical Research
Assay Description
Activity of potent nonpeptidic inhibitor against protease
J Med Chem 43: 843-58 (2000)
Article DOI: 10.1021/jm990281p
BindingDB Entry DOI: 10.7270/Q21N7Z9R