BDBM47411 MLS000558488::N-[(1S)-1-[5-(2-methylbenzyl)sulfonyl-1,3,4-oxadiazol-2-yl]-2-phenyl-ethyl]carbamic acid tert-butyl ester::N-[(1S)-1-[5-[(2-methylphenyl)methylsulfonyl]-1,3,4-oxadiazol-2-yl]-2-phenylethyl]carbamic acid tert-butyl ester::SMR000149004::[(S)-2-Phenyl-1-(5-o-tolylmethanesulfonyl-[1,3,4]oxadiazol-2-yl)-ethyl]-carbamic acid tert-butyl ester::cid_9551645::tert-butyl N-[(1S)-1-[5-[(2-methylphenyl)methylsulfonyl]-1,3,4-oxadiazol-2-yl]-2-phenyl-ethyl]carbamate::tert-butyl N-[(1S)-1-[5-[(2-methylphenyl)methylsulfonyl]-1,3,4-oxadiazol-2-yl]-2-phenylethyl]carbamate
SMILES: Cc1ccccc1CS(=O)(=O)c1nnc(o1)[C@H](Cc1ccccc1)NC(=O)OC(C)(C)C
InChI Key: InChIKey=OPZXUEIGPNYNBQ-IBGZPJMESA-N
Data: 5 IC50
Activity Spreadsheet -- Enzyme Inhibition Constant Data from BindingDB
Found 5 hits for monomerid = 47411
Trg + Lig
Ki
nM
ΔG°
kcal/mole
IC50
nM
Kd
nM
EC50/IC50
nM
koff
s-1
kon
M-1s-1
pHTemp
°C
Tyrosine-protein kinase JAK2
(Homo sapiens (Human))
BDBM47411
(MLS000558488 | N-[(1S)-1-[5-(2-methylbenzyl)sulfon...)
Show SMILES Cc1ccccc1CS(=O)(=O)c1nnc(o1)[C@H](Cc1ccccc1)NC(=O)OC(C)(C)C
Show InChI InChI=1S/C23H27N3O5S/c1-16-10-8-9-13-18(16)15-32(28,29)22-26-25-20(30-22)19(14-17-11-6-5-7-12-17)24-21(27)31-23(2,3)4/h5-13,19H,14-15H2,1-4H3,(H,24,27)/t19-/m0/s1
Reactome pathway
PCBioAssay
n/an/a 5.33E+3n/an/an/an/an/an/a
The Scripps Research Institute Molecular Screening Center
Curated by PubChem BioAssay
Assay Description
Source (MLPCN Center Name): The Scripps Research Institute Molecular Screening Center (SRIMSC) Center Affiliation: The Scripps Research Institute (TS...
PubChem Bioassay (2009)
BindingDB Entry DOI: 10.7270/Q20863Q9
Sphingosine 1-phosphate receptor 4
(Homo sapiens (Human))
BDBM47411
(MLS000558488 | N-[(1S)-1-[5-(2-methylbenzyl)sulfon...)
Show SMILES Cc1ccccc1CS(=O)(=O)c1nnc(o1)[C@H](Cc1ccccc1)NC(=O)OC(C)(C)C
Show InChI InChI=1S/C23H27N3O5S/c1-16-10-8-9-13-18(16)15-32(28,29)22-26-25-20(30-22)19(14-17-11-6-5-7-12-17)24-21(27)31-23(2,3)4/h5-13,19H,14-15H2,1-4H3,(H,24,27)/t19-/m0/s1
NCI pathway
Reactome pathway
PCBioAssay
n/an/a 3.49E+3n/an/an/an/an/an/a
The Scripps Research Institute Molecular Screening Center
Curated by PubChem BioAssay
Assay Description
Source (MLPCN Center Name): The Scripps Research Institute Molecular Screening Center (SRISMC) Center Affiliation: The Scripps Research Institute (TS...
PubChem Bioassay (2010)
BindingDB Entry DOI: 10.7270/Q2319TBQ
DNA damage-inducible transcript 3 protein
(Mus musculus)
BDBM47411
(MLS000558488 | N-[(1S)-1-[5-(2-methylbenzyl)sulfon...)
Show SMILES Cc1ccccc1CS(=O)(=O)c1nnc(o1)[C@H](Cc1ccccc1)NC(=O)OC(C)(C)C
Show InChI InChI=1S/C23H27N3O5S/c1-16-10-8-9-13-18(16)15-32(28,29)22-26-25-20(30-22)19(14-17-11-6-5-7-12-17)24-21(27)31-23(2,3)4/h5-13,19H,14-15H2,1-4H3,(H,24,27)/t19-/m0/s1
PCBioAssay
n/an/a 4.10E+3n/an/an/an/an/an/a
Emory University Molecular Libraries Screening Center
Curated by PubChem BioAssay
Assay Description
NIH Molecular Libraries Screening Centers Network [MLSCN] Emory Chemical Biology Discovery Center in MLSCN Assay provider: Dr. Randal Kaufman, Univer...
PubChem Bioassay (2011)
BindingDB Entry DOI: 10.7270/Q28C9TQN
XBP1
(Homo sapiens (Human))
BDBM47411
(MLS000558488 | N-[(1S)-1-[5-(2-methylbenzyl)sulfon...)
Show SMILES Cc1ccccc1CS(=O)(=O)c1nnc(o1)[C@H](Cc1ccccc1)NC(=O)OC(C)(C)C
Show InChI InChI=1S/C23H27N3O5S/c1-16-10-8-9-13-18(16)15-32(28,29)22-26-25-20(30-22)19(14-17-11-6-5-7-12-17)24-21(27)31-23(2,3)4/h5-13,19H,14-15H2,1-4H3,(H,24,27)/t19-/m0/s1
PCBioAssay
n/an/a 5.27E+3n/an/an/an/an/an/a
Emory University Molecular Libraries Screening Center
Curated by PubChem BioAssay
Assay Description
NIH Molecular Libraries Screening Centers Network [MLSCN] Emory Chemical Biology Discovery Center in MLSCN Assay provider: Dr. Randal Kaufman, Univer...
PubChem Bioassay (2011)
BindingDB Entry DOI: 10.7270/Q2NK3CGB
DNA damage-inducible transcript 3 protein
(Mus musculus)
BDBM47411
(MLS000558488 | N-[(1S)-1-[5-(2-methylbenzyl)sulfon...)
Show SMILES Cc1ccccc1CS(=O)(=O)c1nnc(o1)[C@H](Cc1ccccc1)NC(=O)OC(C)(C)C
Show InChI InChI=1S/C23H27N3O5S/c1-16-10-8-9-13-18(16)15-32(28,29)22-26-25-20(30-22)19(14-17-11-6-5-7-12-17)24-21(27)31-23(2,3)4/h5-13,19H,14-15H2,1-4H3,(H,24,27)/t19-/m0/s1
PCBioAssay
n/an/a 4.10E+3n/an/an/an/an/an/a
Emory University Molecular Libraries Screening Center
Curated by PubChem BioAssay
Assay Description
NIH Molecular Libraries Screening Centers Network [MLSCN] Emory Chemical Biology Discovery Center in MLSCN Assay provider: Dr. Randal Kaufman, Univer...
PubChem Bioassay (2010)
BindingDB Entry DOI: 10.7270/Q2PC30VZ