BDBM47765 MLS000677175::N-(dibenzylcarbamothioyl)-2-methylpropanamide::N-(dibenzylthiocarbamoyl)-2-methyl-propionamide::N-[(dibenzylamino)carbonothioyl]-2-methylpropanamide::N-[[bis(phenylmethyl)amino]-sulfanylidenemethyl]-2-methylpropanamide::N-[bis(phenylmethyl)carbamothioyl]-2-methyl-propanamide::SMR000270987::cid_801325
SMILES: CC(C)C(=O)NC(=S)N(Cc1ccccc1)Cc1ccccc1
InChI Key: InChIKey=DHJTUJFNFPVBIW-UHFFFAOYSA-N
Data: 5 EC50
Activity Spreadsheet -- Enzyme Inhibition Constant Data from BindingDB
Found 5 hits for monomerid = 47765
Trg + Lig
Ki
nM
ΔG°
kcal/mole
IC50
nM
Kd
nM
EC50/IC50
nM
koff
s-1
kon
M-1s-1
pHTemp
°C
Regulator of G-protein signaling 8
(Homo sapiens (Human))
BDBM47765
(MLS000677175 | N-(dibenzylcarbamothioyl)-2-methylp...)
Show SMILES CC(C)C(=O)NC(=S)N(Cc1ccccc1)Cc1ccccc1
Show InChI InChI=1S/C19H22N2OS/c1-15(2)18(22)20-19(23)21(13-16-9-5-3-6-10-16)14-17-11-7-4-8-12-17/h3-12,15H,13-14H2,1-2H3,(H,20,22,23)
Reactome pathway
PCBioAssay
n/an/an/an/a>3.00E+4n/an/an/an/a
NMMLSC
Curated by PubChem BioAssay
Assay Description
University of New Mexico Assay Overview: Assay Support: NIH R21NS057014 HTS to identify small molecule regulators of RGS family protein interaction...
PubChem Bioassay (2009)
BindingDB Entry DOI: 10.7270/Q2TM78JD
Regulator of G-protein signaling 7
(Homo sapiens (Human))
BDBM47765
(MLS000677175 | N-(dibenzylcarbamothioyl)-2-methylp...)
Show SMILES CC(C)C(=O)NC(=S)N(Cc1ccccc1)Cc1ccccc1
Show InChI InChI=1S/C19H22N2OS/c1-15(2)18(22)20-19(23)21(13-16-9-5-3-6-10-16)14-17-11-7-4-8-12-17/h3-12,15H,13-14H2,1-2H3,(H,20,22,23)
PCBioAssay
n/an/an/an/a>3.00E+4n/an/an/an/a
NMMLSC
Curated by PubChem BioAssay
Assay Description
University of New Mexico Assay Overview: Assay Support: NIH R21NS057014 HTS to identify small molecule regulators of RGS family protein interaction...
PubChem Bioassay (2009)
BindingDB Entry DOI: 10.7270/Q2PV6HS7
Regulator of G-protein signaling 4
(Homo sapiens (Human))
BDBM47765
(MLS000677175 | N-(dibenzylcarbamothioyl)-2-methylp...)
Show SMILES CC(C)C(=O)NC(=S)N(Cc1ccccc1)Cc1ccccc1
Show InChI InChI=1S/C19H22N2OS/c1-15(2)18(22)20-19(23)21(13-16-9-5-3-6-10-16)14-17-11-7-4-8-12-17/h3-12,15H,13-14H2,1-2H3,(H,20,22,23)
PCBioAssay
n/an/an/an/a 3.00E+4n/an/an/an/a
NMMLSC
Curated by PubChem BioAssay
Assay Description
University of New Mexico Assay Overview: Assay Support: NIH R21NS057014 HTS to identify small molecule regulators of RGS family protein interaction...
PubChem Bioassay (2009)
BindingDB Entry DOI: 10.7270/Q2F76B0G
Regulator of G-protein signaling 16
(Homo sapiens (Human))
BDBM47765
(MLS000677175 | N-(dibenzylcarbamothioyl)-2-methylp...)
Show SMILES CC(C)C(=O)NC(=S)N(Cc1ccccc1)Cc1ccccc1
Show InChI InChI=1S/C19H22N2OS/c1-15(2)18(22)20-19(23)21(13-16-9-5-3-6-10-16)14-17-11-7-4-8-12-17/h3-12,15H,13-14H2,1-2H3,(H,20,22,23)
PCBioAssay
n/an/an/an/a>3.00E+4n/an/an/an/a
NMMLSC
Curated by PubChem BioAssay
Assay Description
University of New Mexico Assay Overview: Assay Support: NIH R21NS057014 HTS to identify small molecule regulators of RGS family protein interaction...
PubChem Bioassay (2009)
BindingDB Entry DOI: 10.7270/Q2FB51BW
Regulator of G-protein signaling 19
(Homo sapiens (Human))
BDBM47765
(MLS000677175 | N-(dibenzylcarbamothioyl)-2-methylp...)
Show SMILES CC(C)C(=O)NC(=S)N(Cc1ccccc1)Cc1ccccc1
Show InChI InChI=1S/C19H22N2OS/c1-15(2)18(22)20-19(23)21(13-16-9-5-3-6-10-16)14-17-11-7-4-8-12-17/h3-12,15H,13-14H2,1-2H3,(H,20,22,23)
Reactome pathway
PCBioAssay
n/an/an/an/a>3.00E+4n/an/an/an/a
NMMLSC
Curated by PubChem BioAssay
Assay Description
University of New Mexico Assay Overview: Assay Support: NIH R21NS057014 HTS to identify small molecule regulators of RGS family protein interaction...
PubChem Bioassay (2009)
BindingDB Entry DOI: 10.7270/Q2K35S27