BDBM4798 (2E)-N-{4-[(3-bromophenyl)amino]quinazolin-6-yl}-N'-[3-(dimethylamino)propyl]but-2-enediamide::(2E)-N1-[4-(3-Bromoanilino)-6-quinazolinyl]-N4-[3-(dimethylamino)propyl]-2-butenediamide::6-Substituted 4-Anilinoquinazoline 25
SMILES: CN(C)CCCNC(=O)\C=C\C(=O)Nc1ccc2ncnc(Nc3cccc(Br)c3)c2c1
InChI Key: InChIKey=JKAXXKYYTNYYGM-MDZDMXLPSA-N
Data: 1 IC50
Activity Spreadsheet -- Enzyme Inhibition Constant Data from BindingDB
Found 1 hit for monomerid = 4798
Trg + Lig
Ki
nM
ΔG°
kcal/mole
IC50
nM
Kd
nM
EC50/IC50
nM
koff
s-1
kon
M-1s-1
pHTemp
°C
Epidermal growth factor receptor
(Homo sapiens (Human))
BDBM4798
((2E)-N-{4-[(3-bromophenyl)amino]quinazolin-6-yl}-N...)
Show SMILES CN(C)CCCNC(=O)\C=C\C(=O)Nc1ccc2ncnc(Nc3cccc(Br)c3)c2c1
Show InChI InChI=1S/C23H25BrN6O2/c1-30(2)12-4-11-25-21(31)9-10-22(32)28-18-7-8-20-19(14-18)23(27-15-26-20)29-17-6-3-5-16(24)13-17/h3,5-10,13-15H,4,11-12H2,1-2H3,(H,25,31)(H,28,32)(H,26,27,29)/b10-9+
n/an/a 0.440n/an/an/an/an/an/a
University of Auckland
Assay Description
Enzyme assays for IC50 determinations were performed in 96-well filter plates. IC50 is the inhibitor concentration which inhibits 50% of kinase activ...
J Med Chem 44: 429-40 (2001)
Article DOI: 10.1021/jm000372i
BindingDB Entry DOI: 10.7270/Q2HX19WB