BDBM4819 5-{[(3Z)-5-fluoro-2-oxo-2,3-dihydro-1H-indol-3-ylidene]methyl}-2,4-dimethyl-N-[(1-methylpiperidin-4-yl)methyl]-1H-pyrrole-3-carboxamide::SU11248 analog 12g
SMILES: CN1CCC(CNC(=O)c2c(C)[nH]c(\C=C3/C(=O)Nc4ccc(F)cc34)c2C)CC1
InChI Key: InChIKey=QILQUYGQJMWOFT-WQRHYEAKSA-N
Data: 3 IC50
Activity Spreadsheet -- Enzyme Inhibition Constant Data from BindingDB
Found 3 hits for monomerid = 4819
Trg + Lig
Ki
nM
ΔG°
kcal/mole
IC50
nM
Kd
nM
EC50/IC50
nM
koff
s-1
kon
M-1s-1
pHTemp
°C
Vascular endothelial growth factor receptor 2
(Homo sapiens (Human))
BDBM4819
(5-{[(3Z)-5-fluoro-2-oxo-2,3-dihydro-1H-indol-3-yli...)
Show SMILES CN1CCC(CNC(=O)c2c(C)[nH]c(\C=C3/C(=O)Nc4ccc(F)cc34)c2C)CC1
Show InChI InChI=1S/C23H27FN4O2/c1-13-20(11-18-17-10-16(24)4-5-19(17)27-22(18)29)26-14(2)21(13)23(30)25-12-15-6-8-28(3)9-7-15/h4-5,10-11,15,26H,6-9,12H2,1-3H3,(H,25,30)(H,27,29)/b18-11-
NCI pathway
Reactome pathway
n/an/a 25n/an/an/an/a7.522
SUGEN, Inc.
Assay Description
The assays were performed in 96-well microtiter plates that had been coated with a polyGluTyr peptide. Negative control wells received buffer alone w...
J Med Chem 46: 1116-9 (2003)
Article DOI: 10.1021/jm0204183
BindingDB Entry DOI: 10.7270/Q2D50K5B
Platelet-derived growth factor receptor beta
(Homo sapiens (Human))
BDBM4819
(5-{[(3Z)-5-fluoro-2-oxo-2,3-dihydro-1H-indol-3-yli...)
Show SMILES CN1CCC(CNC(=O)c2c(C)[nH]c(\C=C3/C(=O)Nc4ccc(F)cc34)c2C)CC1
Show InChI InChI=1S/C23H27FN4O2/c1-13-20(11-18-17-10-16(24)4-5-19(17)27-22(18)29)26-14(2)21(13)23(30)25-12-15-6-8-28(3)9-7-15/h4-5,10-11,15,26H,6-9,12H2,1-3H3,(H,25,30)(H,27,29)/b18-11-
NCI pathway
Reactome pathway
n/an/a 3n/an/an/an/an/an/a
SUGEN, Inc.
Assay Description
IC50 is the inhibitor concentration which inhibits 50% of EGF-R or PDGFR-beta kinase autophosphorylation activity. The assay was performed in 96-well...
J Med Chem 46: 1116-9 (2003)
Article DOI: 10.1021/jm0204183
BindingDB Entry DOI: 10.7270/Q2D50K5B
Fibroblast growth factor receptor 1
(Homo sapiens (Human))
BDBM4819
(5-{[(3Z)-5-fluoro-2-oxo-2,3-dihydro-1H-indol-3-yli...)
Show SMILES CN1CCC(CNC(=O)c2c(C)[nH]c(\C=C3/C(=O)Nc4ccc(F)cc34)c2C)CC1
Show InChI InChI=1S/C23H27FN4O2/c1-13-20(11-18-17-10-16(24)4-5-19(17)27-22(18)29)26-14(2)21(13)23(30)25-12-15-6-8-28(3)9-7-15/h4-5,10-11,15,26H,6-9,12H2,1-3H3,(H,25,30)(H,27,29)/b18-11-
NCI pathway
Reactome pathway
n/an/a 200n/an/an/an/an/an/a
SUGEN, Inc.
Assay Description
The assays were performed in 96-well microtiter plates that had been coated with a polyGluTyr peptide. Negative control wells received buffer alone w...
J Med Chem 46: 1116-9 (2003)
Article DOI: 10.1021/jm0204183
BindingDB Entry DOI: 10.7270/Q2D50K5B