BDBM4829 1-[2-amino-6-(2,6-difluorophenyl)pyrido[2,3-d]pyrimidin-7-yl]-3-tert-butylurea::PD089828 analog 10
SMILES: CC(C)(C)NC(=O)Nc1nc2nc(N)ncc2cc1-c1c(F)cccc1F
InChI Key: InChIKey=TWRURKGAWDEAGJ-UHFFFAOYSA-N
Data: 4 IC50
Activity Spreadsheet -- Enzyme Inhibition Constant Data from BindingDB
Found 4 hits for monomerid = 4829
Trg + Lig
Ki
nM
ΔG°
kcal/mole
IC50
nM
Kd
nM
EC50/IC50
nM
koff
s-1
kon
M-1s-1
pHTemp
°C
Platelet-derived growth factor receptor beta
(Homo sapiens (Human))
BDBM4829
(1-[2-amino-6-(2,6-difluorophenyl)pyrido[2,3-d]pyri...)
Show SMILES CC(C)(C)NC(=O)Nc1nc2nc(N)ncc2cc1-c1c(F)cccc1F |(6.86,-1.2,;5.37,-.8,;4.97,.69,;6.46,.29,;4.28,-1.89,;2.8,-1.49,;1.71,-2.58,;2.4,-0,;.91,.4,;-.42,-.37,;-1.76,.4,;-3.09,-.37,;-4.43,.4,;-5.76,-.37,;-4.43,1.94,;-3.09,2.71,;-1.76,1.94,;-.42,2.71,;.91,1.94,;2.24,2.71,;2.24,4.25,;.91,5.02,;3.58,5.02,;4.91,4.25,;4.91,2.71,;3.58,1.94,;3.58,.4,)|
Show InChI InChI=1S/C18H18F2N6O/c1-18(2,3)26-17(27)25-15-10(13-11(19)5-4-6-12(13)20)7-9-8-22-16(21)24-14(9)23-15/h4-8H,1-3H3,(H4,21,22,23,24,25,26,27)
NCI pathway
Reactome pathway
n/an/a 1.67E+3n/an/an/an/a7.425
Parke-Davis Pharmaceutical Research
Assay Description
The kinase activity is the enzyme activity that catalyzes the transfer of the terminal phosphate from [gamma-32P] ATP to the poly (E: Y) substrate. N...
Bioorg Med Chem Lett 7: 2415-20 (1997)
Article DOI: 10.1074/jbc.M606873200
BindingDB Entry DOI: 10.7270/Q28C9TF2
PDGFR-beta/Platelet-derived growth factor receptor alpha
(Homo sapiens (Human))
BDBM4829
(1-[2-amino-6-(2,6-difluorophenyl)pyrido[2,3-d]pyri...)
Show SMILES CC(C)(C)NC(=O)Nc1nc2nc(N)ncc2cc1-c1c(F)cccc1F |(6.86,-1.2,;5.37,-.8,;4.97,.69,;6.46,.29,;4.28,-1.89,;2.8,-1.49,;1.71,-2.58,;2.4,-0,;.91,.4,;-.42,-.37,;-1.76,.4,;-3.09,-.37,;-4.43,.4,;-5.76,-.37,;-4.43,1.94,;-3.09,2.71,;-1.76,1.94,;-.42,2.71,;.91,1.94,;2.24,2.71,;2.24,4.25,;.91,5.02,;3.58,5.02,;4.91,4.25,;4.91,2.71,;3.58,1.94,;3.58,.4,)|
Show InChI InChI=1S/C18H18F2N6O/c1-18(2,3)26-17(27)25-15-10(13-11(19)5-4-6-12(13)20)7-9-8-22-16(21)24-14(9)23-15/h4-8H,1-3H3,(H4,21,22,23,24,25,26,27)
Reactome pathway
n/an/a 1.67E+3n/an/an/an/an/an/a
Parke-Davis Pharmaceutical Research
Assay Description
Inhibitory activity against platelet-derived growth factor receptor
Bioorg Med Chem Lett 7: 2415-20 (1997)
Article DOI: 10.1074/jbc.M606873200
BindingDB Entry DOI: 10.7270/Q28C9TF2
Proto-oncogene tyrosine-protein kinase Src
(Homo sapiens (Human))
BDBM4829
(1-[2-amino-6-(2,6-difluorophenyl)pyrido[2,3-d]pyri...)
Show SMILES CC(C)(C)NC(=O)Nc1nc2nc(N)ncc2cc1-c1c(F)cccc1F |(6.86,-1.2,;5.37,-.8,;4.97,.69,;6.46,.29,;4.28,-1.89,;2.8,-1.49,;1.71,-2.58,;2.4,-0,;.91,.4,;-.42,-.37,;-1.76,.4,;-3.09,-.37,;-4.43,.4,;-5.76,-.37,;-4.43,1.94,;-3.09,2.71,;-1.76,1.94,;-.42,2.71,;.91,1.94,;2.24,2.71,;2.24,4.25,;.91,5.02,;3.58,5.02,;4.91,4.25,;4.91,2.71,;3.58,1.94,;3.58,.4,)|
Show InChI InChI=1S/C18H18F2N6O/c1-18(2,3)26-17(27)25-15-10(13-11(19)5-4-6-12(13)20)7-9-8-22-16(21)24-14(9)23-15/h4-8H,1-3H3,(H4,21,22,23,24,25,26,27)
n/an/a 800n/an/an/an/an/an/a
Parke-Davis Pharmaceutical Research
Assay Description
The kinase activity is the enzyme activity that catalyzes the transfer of the terminal phosphate from [gamma-32P] labeled ATP to the poly (E: Y) subs...
Bioorg Med Chem Lett 7: 2415-20 (1997)
Article DOI: 10.1074/jbc.M606873200
BindingDB Entry DOI: 10.7270/Q28C9TF2
Fibroblast growth factor receptor 1
(Homo sapiens (Human))
BDBM4829
(1-[2-amino-6-(2,6-difluorophenyl)pyrido[2,3-d]pyri...)
Show SMILES CC(C)(C)NC(=O)Nc1nc2nc(N)ncc2cc1-c1c(F)cccc1F |(6.86,-1.2,;5.37,-.8,;4.97,.69,;6.46,.29,;4.28,-1.89,;2.8,-1.49,;1.71,-2.58,;2.4,-0,;.91,.4,;-.42,-.37,;-1.76,.4,;-3.09,-.37,;-4.43,.4,;-5.76,-.37,;-4.43,1.94,;-3.09,2.71,;-1.76,1.94,;-.42,2.71,;.91,1.94,;2.24,2.71,;2.24,4.25,;.91,5.02,;3.58,5.02,;4.91,4.25,;4.91,2.71,;3.58,1.94,;3.58,.4,)|
Show InChI InChI=1S/C18H18F2N6O/c1-18(2,3)26-17(27)25-15-10(13-11(19)5-4-6-12(13)20)7-9-8-22-16(21)24-14(9)23-15/h4-8H,1-3H3,(H4,21,22,23,24,25,26,27)
NCI pathway
Reactome pathway
n/an/a 110n/an/an/an/an/an/a
Parke-Davis Pharmaceutical Research
Assay Description
The kinase activity is the enzyme activity that catalyzes the transfer of the terminal phosphate from [gamma-32P] ATP to the poly (E: Y) substrate. N...
Bioorg Med Chem Lett 7: 2415-20 (1997)
Article DOI: 10.1074/jbc.M606873200
BindingDB Entry DOI: 10.7270/Q28C9TF2