BDBM484196 CDD-1713
SMILES: COc1cc(cc(C=O)c1OCC(=O)N(C)C)-c1cccc2[nH]ncc12
InChI Key: InChIKey=LDHIKLLVVUEYPE-UHFFFAOYSA-N
Data: 1 KI  1 IC50
PDB links: 1 PDB ID matches this monomer.
Activity Spreadsheet -- Enzyme Inhibition Constant Data from BindingDB
Found 2 hits for monomerid = 484196
Trg + Lig
Ki
nM
ΔG°
kcal/mole
IC50
nM
Kd
nM
EC50/IC50
nM
koff
s-1
kon
M-1s-1
pHTemp
°C
Replicase polyprotein 1ab
(2019-nCoV)
BDBM484196
(CDD-1713)
Show SMILES COc1cc(cc(C=O)c1OCC(=O)N(C)C)-c1cccc2[nH]ncc12
Show InChI InChI=1S/C19H19N3O4/c1-22(2)18(24)11-26-19-13(10-23)7-12(8-17(19)25-3)14-5-4-6-16-15(14)9-20-21-16/h4-10H,11H2,1-3H3,(H,20,21)
NCI pathway
Reactome pathway
65n/an/an/an/an/an/an/an/a
Baylor College of Medicine
Assay Description
To determine the Ki values of active compounds, 25 nM Mpro was mixed with increasing concentrations of compounds (from 4 nM to 4,000 nM with twofold ...
Proc Natl Acad Sci U S A 118: (2021)
Replicase polyprotein 1ab
(2019-nCoV)
BDBM484196
(CDD-1713)
Show SMILES COc1cc(cc(C=O)c1OCC(=O)N(C)C)-c1cccc2[nH]ncc12
Show InChI InChI=1S/C19H19N3O4/c1-22(2)18(24)11-26-19-13(10-23)7-12(8-17(19)25-3)14-5-4-6-16-15(14)9-20-21-16/h4-10H,11H2,1-3H3,(H,20,21)
NCI pathway
Reactome pathway
n/an/a 5.19E+3n/an/an/an/an/an/a
Baylor College of Medicine
Assay Description
Inhibition of SARS-CoV-2 replication in VERO E6 and HEK hACE2 cells was measured using an xCELLigence RTCA HT Analyzer (Agilent Technologies), tracki...
Proc Natl Acad Sci U S A 118: (2021)