BDBM4842 1-[2-amino-6-(3,5-diethylphenyl)pyrido[2,3-d]pyrimidin-7-yl]-3-tert-butylurea::PD089828 analog 23
SMILES: CCc1cc(CC)cc(c1)-c1cc2cnc(N)nc2nc1NC(=O)NC(C)(C)C
InChI Key: InChIKey=JLZJVFRHDHKOBW-UHFFFAOYSA-N
Data: 4 IC50
Activity Spreadsheet -- Enzyme Inhibition Constant Data from BindingDB
Found 4 hits for monomerid = 4842
Trg + Lig
Ki
nM
ΔG°
kcal/mole
IC50
nM
Kd
nM
EC50/IC50
nM
koff
s-1
kon
M-1s-1
pHTemp
°C
Platelet-derived growth factor receptor beta
(Homo sapiens (Human))
BDBM4842
(1-[2-amino-6-(3,5-diethylphenyl)pyrido[2,3-d]pyrim...)
Show SMILES CCc1cc(CC)cc(c1)-c1cc2cnc(N)nc2nc1NC(=O)NC(C)(C)C
Show InChI InChI=1S/C22H28N6O/c1-6-13-8-14(7-2)10-15(9-13)17-11-16-12-24-20(23)26-18(16)25-19(17)27-21(29)28-22(3,4)5/h8-12H,6-7H2,1-5H3,(H4,23,24,25,26,27,28,29)
NCI pathway
Reactome pathway
n/an/a>5.00E+4n/an/an/an/a7.425
Parke-Davis Pharmaceutical Research
Assay Description
The kinase activity is the enzyme activity that catalyzes the transfer of the terminal phosphate from [gamma-32P] ATP to the poly (E: Y) substrate. N...
Bioorg Med Chem Lett 7: 2415-20 (1997)
Article DOI: 10.1074/jbc.M606873200
BindingDB Entry DOI: 10.7270/Q28C9TF2
PDGFR-beta/Platelet-derived growth factor receptor alpha
(Homo sapiens (Human))
BDBM4842
(1-[2-amino-6-(3,5-diethylphenyl)pyrido[2,3-d]pyrim...)
Show SMILES CCc1cc(CC)cc(c1)-c1cc2cnc(N)nc2nc1NC(=O)NC(C)(C)C
Show InChI InChI=1S/C22H28N6O/c1-6-13-8-14(7-2)10-15(9-13)17-11-16-12-24-20(23)26-18(16)25-19(17)27-21(29)28-22(3,4)5/h8-12H,6-7H2,1-5H3,(H4,23,24,25,26,27,28,29)
Reactome pathway
n/an/a>5.00E+4n/an/an/an/an/an/a
Parke-Davis Pharmaceutical Research
Assay Description
Inhibitory activity against platelet-derived growth factor receptor
Bioorg Med Chem Lett 7: 2415-20 (1997)
Article DOI: 10.1074/jbc.M606873200
BindingDB Entry DOI: 10.7270/Q28C9TF2
Proto-oncogene tyrosine-protein kinase Src
(Homo sapiens (Human))
BDBM4842
(1-[2-amino-6-(3,5-diethylphenyl)pyrido[2,3-d]pyrim...)
Show SMILES CCc1cc(CC)cc(c1)-c1cc2cnc(N)nc2nc1NC(=O)NC(C)(C)C
Show InChI InChI=1S/C22H28N6O/c1-6-13-8-14(7-2)10-15(9-13)17-11-16-12-24-20(23)26-18(16)25-19(17)27-21(29)28-22(3,4)5/h8-12H,6-7H2,1-5H3,(H4,23,24,25,26,27,28,29)
n/an/a>5.00E+4n/an/an/an/an/an/a
Parke-Davis Pharmaceutical Research
Assay Description
The kinase activity is the enzyme activity that catalyzes the transfer of the terminal phosphate from [gamma-32P] labeled ATP to the poly (E: Y) subs...
Bioorg Med Chem Lett 7: 2415-20 (1997)
Article DOI: 10.1074/jbc.M606873200
BindingDB Entry DOI: 10.7270/Q28C9TF2
Fibroblast growth factor receptor 1
(Homo sapiens (Human))
BDBM4842
(1-[2-amino-6-(3,5-diethylphenyl)pyrido[2,3-d]pyrim...)
Show SMILES CCc1cc(CC)cc(c1)-c1cc2cnc(N)nc2nc1NC(=O)NC(C)(C)C
Show InChI InChI=1S/C22H28N6O/c1-6-13-8-14(7-2)10-15(9-13)17-11-16-12-24-20(23)26-18(16)25-19(17)27-21(29)28-22(3,4)5/h8-12H,6-7H2,1-5H3,(H4,23,24,25,26,27,28,29)
NCI pathway
Reactome pathway
n/an/a 7.76E+3n/an/an/an/an/an/a
Parke-Davis Pharmaceutical Research
Assay Description
The kinase activity is the enzyme activity that catalyzes the transfer of the terminal phosphate from [gamma-32P] labeled ATP to the poly (E: Y) subs...
Bioorg Med Chem Lett 7: 2415-20 (1997)
Article DOI: 10.1074/jbc.M606873200
BindingDB Entry DOI: 10.7270/Q28C9TF2