null
SMILES: COc1cc(CNc2ccc(cc2)N2CCCC2)ccc1OCc1ccccc1F
InChI Key: InChIKey=QKTUUPCFPKVPHG-UHFFFAOYSA-N
Activity Spreadsheet -- Enzyme Inhibition Constant Data from BindingDB
Found 5 hits for monomerid = 48718
Trg + Lig
Ki
nM
ΔG°
kcal/mole
IC50
nM
Kd
nM
EC50/IC50
nM
koff
s-1
kon
M-1s-1
pHTemp
°C
Eukaryotic translation initiation factor 4 gamma 1
(Homo sapiens (Human))
BDBM48718
(MLS000578520 | N-[[4-[(2-fluorophenyl)methoxy]-3-m...)
Show SMILES COc1cc(CNc2ccc(cc2)N2CCCC2)ccc1OCc1ccccc1F
Show InChI InChI=1S/C25H27FN2O2/c1-29-25-16-19(8-13-24(25)30-18-20-6-2-3-7-23(20)26)17-27-21-9-11-22(12-10-21)28-14-4-5-15-28/h2-3,6-13,16,27H,4-5,14-15,17-18H2,1H3
Reactome pathway
PCBioAssay
n/an/a 6.40E+4n/an/an/an/an/an/a
Emory University Molecular Libraries Screening Center
Curated by PubChem BioAssay
Assay Description
Dose Response Confirmation for Small Molecule Inhibitors of Eukaryotic Translation Initiation NIH Molecular Libraries Screening Centers Network [MLSC...
PubChem Bioassay (2009)
BindingDB Entry DOI: 10.7270/Q2RN3686
Glucose-6-phosphate 1-dehydrogenase
(Homo sapiens (Human))
BDBM48718
(MLS000578520 | N-[[4-[(2-fluorophenyl)methoxy]-3-m...)
Show SMILES COc1cc(CNc2ccc(cc2)N2CCCC2)ccc1OCc1ccccc1F
Show InChI InChI=1S/C25H27FN2O2/c1-29-25-16-19(8-13-24(25)30-18-20-6-2-3-7-23(20)26)17-27-21-9-11-22(12-10-21)28-14-4-5-15-28/h2-3,6-13,16,27H,4-5,14-15,17-18H2,1H3
PCBioAssay
n/an/a>8.00E+4n/an/an/an/an/an/a
Burnham Center for Chemical Genomics
Curated by PubChem BioAssay
Assay Description
Data Source: Sanford-Burnham Center for Chemical Genomics (SBCCG) Source Affiliation: Sanford-Burnham Medical Research Institute (SBMRI, San Diego CA...
PubChem Bioassay (2011)
BindingDB Entry DOI: 10.7270/Q2V12389
Glucose-6-phosphate dehydrogenase-6-phosphogluconolactonase
(Plasmodium falciparum 3D7)
BDBM48718
(MLS000578520 | N-[[4-[(2-fluorophenyl)methoxy]-3-m...)
Show SMILES COc1cc(CNc2ccc(cc2)N2CCCC2)ccc1OCc1ccccc1F
Show InChI InChI=1S/C25H27FN2O2/c1-29-25-16-19(8-13-24(25)30-18-20-6-2-3-7-23(20)26)17-27-21-9-11-22(12-10-21)28-14-4-5-15-28/h2-3,6-13,16,27H,4-5,14-15,17-18H2,1H3
PCBioAssay
n/an/a>8.00E+4n/an/an/an/an/an/a
Burnham Center for Chemical Genomics
Curated by PubChem BioAssay
Assay Description
Data Source: Sanford-Burnham Center for Chemical Genomics (SBCCG) Source Affiliation: Sanford-Burnham Medical Research Institute (SBMRI, San Diego CA...
PubChem Bioassay (2011)
BindingDB Entry DOI: 10.7270/Q23T9FQ1
Glucose-6-phosphate dehydrogenase-6-phosphogluconolactonase
(Plasmodium falciparum 3D7)
BDBM48718
(MLS000578520 | N-[[4-[(2-fluorophenyl)methoxy]-3-m...)
Show SMILES COc1cc(CNc2ccc(cc2)N2CCCC2)ccc1OCc1ccccc1F
Show InChI InChI=1S/C25H27FN2O2/c1-29-25-16-19(8-13-24(25)30-18-20-6-2-3-7-23(20)26)17-27-21-9-11-22(12-10-21)28-14-4-5-15-28/h2-3,6-13,16,27H,4-5,14-15,17-18H2,1H3
PCBioAssay
n/an/a>8.00E+4n/an/an/an/an/an/a
Burnham Center for Chemical Genomics
Curated by PubChem BioAssay
Assay Description
Data Source: Sanford-Burnham Center for Chemical Genomics (SBCCG) Source Affiliation: Sanford-Burnham Medical Research Institute (SBMRI, San Diego CA...
PubChem Bioassay (2011)
BindingDB Entry DOI: 10.7270/Q27H1H3W
Glucose-6-phosphate dehydrogenase-6-phosphogluconolactonase
(Plasmodium falciparum 3D7)
BDBM48718
(MLS000578520 | N-[[4-[(2-fluorophenyl)methoxy]-3-m...)
Show SMILES COc1cc(CNc2ccc(cc2)N2CCCC2)ccc1OCc1ccccc1F
Show InChI InChI=1S/C25H27FN2O2/c1-29-25-16-19(8-13-24(25)30-18-20-6-2-3-7-23(20)26)17-27-21-9-11-22(12-10-21)28-14-4-5-15-28/h2-3,6-13,16,27H,4-5,14-15,17-18H2,1H3
PCBioAssay
n/an/a 2.39E+3n/an/an/an/an/an/a
Burnham Center for Chemical Genomics
Curated by PubChem BioAssay
Assay Description
Data Source: Sanford-Burnham Center for Chemical Genomics (SBCCG) Source Affiliation: Sanford-Burnham Medical Research Institute (SBMRI, San Diego CA...
PubChem Bioassay (2011)
BindingDB Entry DOI: 10.7270/Q2ZS2TZG