BDBM48749 (5Z)-5-(2,5-dimethoxy-4-pyrrolidino-benzylidene)-3-ethyl-2-ethylimino-thiazolidin-4-one::(5Z)-5-[(2,5-dimethoxy-4-pyrrolidin-1-yl-phenyl)methylidene]-3-ethyl-2-ethylimino-1,3-thiazolidin-4-one::(5Z)-5-[(2,5-dimethoxy-4-pyrrolidin-1-ylphenyl)methylidene]-3-ethyl-2-ethylimino-1,3-thiazolidin-4-one::(5Z)-5-[[2,5-dimethoxy-4-(1-pyrrolidinyl)phenyl]methylidene]-3-ethyl-2-ethylimino-4-thiazolidinone::5-[2,5-dimethoxy-4-(1-pyrrolidinyl)benzylidene]-3-ethyl-2-(ethylimino)-1,3-thiazolidin-4-one::MLS000702004::SMR000228966::cid_6974996
SMILES: CC\N=C1\S\C(=C/c2cc(OC)c(cc2OC)N2CCCC2)C(=O)N1CC
InChI Key: InChIKey=ZRPQOMJWXREVLG-UMWYYCSLSA-N
Data: 3 IC50  1 EC50
Activity Spreadsheet -- Enzyme Inhibition Constant Data from BindingDB
Found 4 hits for monomerid = 48749
Trg + Lig
Ki
nM
ΔG°
kcal/mole
IC50
nM
Kd
nM
EC50/IC50
nM
koff
s-1
kon
M-1s-1
pHTemp
°C
eukaryotic translation initiation factor 4 gamma, 1 isoform 4
(Homo sapiens (Human))
BDBM48749
((5Z)-5-(2,5-dimethoxy-4-pyrrolidino-benzylidene)-3...)
Show SMILES CC\N=C1\S\C(=C/c2cc(OC)c(cc2OC)N2CCCC2)C(=O)N1CC
Show InChI InChI=1S/C20H27N3O3S/c1-5-21-20-23(6-2)19(24)18(27-20)12-14-11-17(26-4)15(13-16(14)25-3)22-9-7-8-10-22/h11-13H,5-10H2,1-4H3/b18-12-,21-20+
Reactome pathway
PCBioAssay
n/an/a 6.40E+4n/an/an/an/an/an/a
Emory University Molecular Libraries Screening Center
Curated by PubChem BioAssay
Assay Description
Dose Response Confirmation for Small Molecule Inhibitors of Eukaryotic Translation Initiation NIH Molecular Libraries Screening Centers Network [MLSC...
PubChem Bioassay (2009)
BindingDB Entry DOI: 10.7270/Q2RN3686
cardiac alpha tropomyosin
(Sus scrofa)
BDBM48749
((5Z)-5-(2,5-dimethoxy-4-pyrrolidino-benzylidene)-3...)
Show SMILES CC\N=C1\S\C(=C/c2cc(OC)c(cc2OC)N2CCCC2)C(=O)N1CC
Show InChI InChI=1S/C20H27N3O3S/c1-5-21-20-23(6-2)19(24)18(27-20)12-14-11-17(26-4)15(13-16(14)25-3)22-9-7-8-10-22/h11-13H,5-10H2,1-4H3/b18-12-,21-20+
PCBioAssay
n/an/an/an/a 1.10E+3n/an/an/an/a
The Scripps Research Institute Molecular Screening Center
Curated by PubChem BioAssay
Assay Description
Source (MLPCN Center Name): The Scripps Research Institute Molecular Screening Center (SRIMSC) Affiliation: The Scripps Research Institute, TSRI Assa...
PubChem Bioassay (2011)
BindingDB Entry DOI: 10.7270/Q21N7ZKB
G-protein coupled receptor 35
(Homo sapiens (Human))
BDBM48749
((5Z)-5-(2,5-dimethoxy-4-pyrrolidino-benzylidene)-3...)
Show SMILES CC\N=C1\S\C(=C/c2cc(OC)c(cc2OC)N2CCCC2)C(=O)N1CC
Show InChI InChI=1S/C20H27N3O3S/c1-5-21-20-23(6-2)19(24)18(27-20)12-14-11-17(26-4)15(13-16(14)25-3)22-9-7-8-10-22/h11-13H,5-10H2,1-4H3/b18-12-,21-20+
PCBioAssay
n/an/a 898n/an/an/an/an/an/a
Burnham Center for Chemical Genomics
Curated by PubChem BioAssay
Assay Description
Data Source: Sanford-Burnham Center for Chemical Genomics (SBCCG) Source Affiliation: Sanford-Burnham Medical Research Institute (SBMRI, San Diego, C...
PubChem Bioassay (2010)
BindingDB Entry DOI: 10.7270/Q2TQ5ZZB
BZLF2
(Human herpesvirus 4 type 2)
BDBM48749
((5Z)-5-(2,5-dimethoxy-4-pyrrolidino-benzylidene)-3...)
Show SMILES CC\N=C1\S\C(=C/c2cc(OC)c(cc2OC)N2CCCC2)C(=O)N1CC
Show InChI InChI=1S/C20H27N3O3S/c1-5-21-20-23(6-2)19(24)18(27-20)12-14-11-17(26-4)15(13-16(14)25-3)22-9-7-8-10-22/h11-13H,5-10H2,1-4H3/b18-12-,21-20+
PCBioAssay
n/an/a 2.08E+4n/an/an/an/an/an/a
Emory University Molecular Libraries Screening Center
Curated by PubChem BioAssay
Assay Description
NIH Molecular Libraries Screening Centers Network [MLSCN] Emory Chemical Biology Discovery Center in MLSCN Assay provider: Theodore Jardetzky; Northw...
PubChem Bioassay (2008)
BindingDB Entry DOI: 10.7270/Q2057DCW