BDBM490785 US10968242, Example 15 Peak 1
SMILES: Cn1cnc2n(cnc2c1=O)[C@@H]1C[C@@H]2OP(O)(=O)O[C@@H]3[C@@H](COP(S)(=O)O[C@@H]1[C@@H]2O)O[C@H]([C@@H]3F)n1cnc2c(N)ncnc12
InChI Key: InChIKey=BTCUYIDXTLYAGE-GZQJALTCSA-N
Data: 1 KI  2 Kd
Activity Spreadsheet -- Enzyme Inhibition Constant Data from BindingDB
Found 3 hits for monomerid = 490785
Trg + Lig
Ki
nM
ΔG°
kcal/mole
IC50
nM
Kd
nM
EC50/IC50
nM
koff
s-1
kon
M-1s-1
pHTemp
°C
Stimulator of interferon genes protein
(Human)
BDBM490785
(US10968242, Example 15 Peak 1)
Show SMILES Cn1cnc2n(cnc2c1=O)[C@@H]1C[C@@H]2OP(O)(=O)O[C@@H]3[C@@H](COP(S)(=O)O[C@@H]1[C@@H]2O)O[C@H]([C@@H]3F)n1cnc2c(N)ncnc12 |r|
Show InChI InChI=1S/C21H24FN9O10P2S/c1-29-5-28-19-13(20(29)33)27-6-30(19)8-2-9-14(32)15(8)41-43(36,44)37-3-10-16(40-42(34,35)39-9)11(22)21(38-10)31-7-26-12-17(23)24-4-25-18(12)31/h4-11,14-16,21,32H,2-3H2,1H3,(H,34,35)(H,36,44)(H2,23,24,25)/t8-,9+,10-,11-,14-,15+,16-,21-,43?/m1/s1
NCI pathway
Reactome pathway
US Patent
37n/an/an/an/an/an/an/an/a
Pfizer Inc.
US Patent
Assay Description
A radioligand binding assay was developed to determine compound interactions were competitive with a tritium-labeled version of the native STING liga...
US Patent US10968242 (2021)
Stimulator of interferon genes protein [H232R]
(Homo sapiens (Human))
BDBM490785
(US10968242, Example 15 Peak 1)
Show SMILES Cn1cnc2n(cnc2c1=O)[C@@H]1C[C@@H]2OP(O)(=O)O[C@@H]3[C@@H](COP(S)(=O)O[C@@H]1[C@@H]2O)O[C@H]([C@@H]3F)n1cnc2c(N)ncnc12 |r|
Show InChI InChI=1S/C21H24FN9O10P2S/c1-29-5-28-19-13(20(29)33)27-6-30(19)8-2-9-14(32)15(8)41-43(36,44)37-3-10-16(40-42(34,35)39-9)11(22)21(38-10)31-7-26-12-17(23)24-4-25-18(12)31/h4-11,14-16,21,32H,2-3H2,1H3,(H,34,35)(H,36,44)(H2,23,24,25)/t8-,9+,10-,11-,14-,15+,16-,21-,43?/m1/s1
Reactome pathway
US Patent
n/an/an/a 102n/an/an/an/an/a
Pfizer Inc.
US Patent
Assay Description
Surface plasmon resonance (SPR) STING agonist binding studies were carried out using a Biacore T200 instrument (GE Healthcare) at 4° C. in a 150 mM K...
US Patent US10968242 (2021)
Stimulator of interferon genes protein
(Human)
BDBM490785
(US10968242, Example 15 Peak 1)
Show SMILES Cn1cnc2n(cnc2c1=O)[C@@H]1C[C@@H]2OP(O)(=O)O[C@@H]3[C@@H](COP(S)(=O)O[C@@H]1[C@@H]2O)O[C@H]([C@@H]3F)n1cnc2c(N)ncnc12 |r|
Show InChI InChI=1S/C21H24FN9O10P2S/c1-29-5-28-19-13(20(29)33)27-6-30(19)8-2-9-14(32)15(8)41-43(36,44)37-3-10-16(40-42(34,35)39-9)11(22)21(38-10)31-7-26-12-17(23)24-4-25-18(12)31/h4-11,14-16,21,32H,2-3H2,1H3,(H,34,35)(H,36,44)(H2,23,24,25)/t8-,9+,10-,11-,14-,15+,16-,21-,43?/m1/s1
NCI pathway
Reactome pathway
US Patent
n/an/an/a 45n/an/an/an/an/a
Pfizer Inc.
US Patent
Assay Description
Surface plasmon resonance (SPR) STING agonist binding studies were carried out using a Biacore T200 instrument (GE Healthcare) at 4° C. in a 150 mM K...
US Patent US10968242 (2021)