null
SMILES: Cn1cnc2n(cnc2c1=O)[C@@H]1C[C@@H]2OP(S)(=O)O[C@@H]3[C@@H](COP(S)(=O)O[C@@H]1[C@@H]2O)O[C@H]([C@H]3F)n1cnc2c1ncn(C)c2=O
InChI Key: InChIKey=UPQZHDLOWBOXBM-ACVOEFHBSA-N
Activity Spreadsheet -- Enzyme Inhibition Constant Data from BindingDB
Found 3 hits for monomerid = 490794
Trg + Lig
Ki
nM
ΔG°
kcal/mole
IC50
nM
Kd
nM
EC50/IC50
nM
koff
s-1
kon
M-1s-1
pHTemp
°C
Stimulator of interferon genes protein
(Human)
BDBM490794
(US10968242, Example 19 Peak 3)
Show SMILES Cn1cnc2n(cnc2c1=O)[C@@H]1C[C@@H]2OP(S)(=O)O[C@@H]3[C@@H](COP(S)(=O)O[C@@H]1[C@@H]2O)O[C@H]([C@H]3F)n1cnc2c1ncn(C)c2=O |r|
Show InChI InChI=1S/C22H25FN8O10P2S2/c1-28-5-26-18-13(20(28)33)24-7-30(18)9-3-10-15(32)16(9)40-42(35,44)37-4-11-17(41-43(36,45)39-10)12(23)22(38-11)31-8-25-14-19(31)27-6-29(2)21(14)34/h5-12,15-17,22,32H,3-4H2,1-2H3,(H,35,44)(H,36,45)/t9-,10+,11-,12+,15-,16+,17-,22-,42?,43?/m1/s1
NCI pathway
Reactome pathway
US Patent
2n/an/an/an/an/an/an/an/a
Pfizer Inc.
US Patent
Assay Description
A radioligand binding assay was developed to determine compound interactions were competitive with a tritium-labeled version of the native STING liga...
US Patent US10968242 (2021)
Stimulator of interferon genes protein [H232R]
(Homo sapiens (Human))
BDBM490794
(US10968242, Example 19 Peak 3)
Show SMILES Cn1cnc2n(cnc2c1=O)[C@@H]1C[C@@H]2OP(S)(=O)O[C@@H]3[C@@H](COP(S)(=O)O[C@@H]1[C@@H]2O)O[C@H]([C@H]3F)n1cnc2c1ncn(C)c2=O |r|
Show InChI InChI=1S/C22H25FN8O10P2S2/c1-28-5-26-18-13(20(28)33)24-7-30(18)9-3-10-15(32)16(9)40-42(35,44)37-4-11-17(41-43(36,45)39-10)12(23)22(38-11)31-8-25-14-19(31)27-6-29(2)21(14)34/h5-12,15-17,22,32H,3-4H2,1-2H3,(H,35,44)(H,36,45)/t9-,10+,11-,12+,15-,16+,17-,22-,42?,43?/m1/s1
Reactome pathway
US Patent
n/an/an/a 2n/an/an/an/an/a
Pfizer Inc.
US Patent
Assay Description
Surface plasmon resonance (SPR) STING agonist binding studies were carried out using a Biacore T200 instrument (GE Healthcare) at 4° C. in a 150 mM K...
US Patent US10968242 (2021)
Stimulator of interferon genes protein
(Human)
BDBM490794
(US10968242, Example 19 Peak 3)
Show SMILES Cn1cnc2n(cnc2c1=O)[C@@H]1C[C@@H]2OP(S)(=O)O[C@@H]3[C@@H](COP(S)(=O)O[C@@H]1[C@@H]2O)O[C@H]([C@H]3F)n1cnc2c1ncn(C)c2=O |r|
Show InChI InChI=1S/C22H25FN8O10P2S2/c1-28-5-26-18-13(20(28)33)24-7-30(18)9-3-10-15(32)16(9)40-42(35,44)37-4-11-17(41-43(36,45)39-10)12(23)22(38-11)31-8-25-14-19(31)27-6-29(2)21(14)34/h5-12,15-17,22,32H,3-4H2,1-2H3,(H,35,44)(H,36,45)/t9-,10+,11-,12+,15-,16+,17-,22-,42?,43?/m1/s1
NCI pathway
Reactome pathway
US Patent
n/an/an/a 3n/an/an/an/an/a
Pfizer Inc.
US Patent
Assay Description
Surface plasmon resonance (SPR) STING agonist binding studies were carried out using a Biacore T200 instrument (GE Healthcare) at 4° C. in a 150 mM K...
US Patent US10968242 (2021)