BDBM4909 (3Z)-6-phenyl-3-(4,5,6,7-tetrahydro-1H-indol-2-ylmethylidene)-2,3-dihydro-1H-indol-2-one::6-Phenyl-3-(4,5,6,7-tetrahydro-1H-indol-2-ylmethylene)-1,3-dihydroindol-2-one::Indolin-2-one deriv. 4f
SMILES: O=C1Nc2cc(ccc2\C1=C\c1cc2CCCCc2[nH]1)-c1ccccc1
InChI Key: InChIKey=BCEALSZPAPLOJG-ZHZULCJRSA-N
Data: 5 IC50
Activity Spreadsheet -- Enzyme Inhibition Constant Data from BindingDB
Found 5 hits for monomerid = 4909
Trg + Lig
Ki
nM
ΔG°
kcal/mole
IC50
nM
Kd
nM
EC50/IC50
nM
koff
s-1
kon
M-1s-1
pHTemp
°C
Vascular endothelial growth factor receptor 2
(Homo sapiens (Human))
BDBM4909
((3Z)-6-phenyl-3-(4,5,6,7-tetrahydro-1H-indol-2-ylm...)
Show SMILES O=C1Nc2cc(ccc2\C1=C\c1cc2CCCCc2[nH]1)-c1ccccc1
Show InChI InChI=1S/C23H20N2O/c26-23-20(14-18-12-17-8-4-5-9-21(17)24-18)19-11-10-16(13-22(19)25-23)15-6-2-1-3-7-15/h1-3,6-7,10-14,24H,4-5,8-9H2,(H,25,26)/b20-14-
NCI pathway
Reactome pathway
n/an/a>2.00E+4n/an/an/an/a7.522
SUGEN, Inc.
Assay Description
The assays were performed in 96-well microtiter plates that had been coated with a polyGluTyr peptide. Negative control wells received buffer alone w...
J Med Chem 43: 2655-63 (2000)
Article DOI: 10.1021/jm9906116
BindingDB Entry DOI: 10.7270/Q2W66J0N
Fibroblast growth factor receptor 1
(Homo sapiens (Human))
BDBM4909
((3Z)-6-phenyl-3-(4,5,6,7-tetrahydro-1H-indol-2-ylm...)
Show SMILES O=C1Nc2cc(ccc2\C1=C\c1cc2CCCCc2[nH]1)-c1ccccc1
Show InChI InChI=1S/C23H20N2O/c26-23-20(14-18-12-17-8-4-5-9-21(17)24-18)19-11-10-16(13-22(19)25-23)15-6-2-1-3-7-15/h1-3,6-7,10-14,24H,4-5,8-9H2,(H,25,26)/b20-14-
NCI pathway
Reactome pathway
n/an/a>2.00E+4n/an/an/an/an/an/a
SUGEN, Inc.
Assay Description
The assays were performed in 96-well microtiter plates that had been coated with a polyGluTyr peptide. Negative control wells received buffer alone w...
J Med Chem 43: 2655-63 (2000)
Article DOI: 10.1021/jm9906116
BindingDB Entry DOI: 10.7270/Q2W66J0N
Epidermal growth factor receptor
(Homo sapiens (Human))
BDBM4909
((3Z)-6-phenyl-3-(4,5,6,7-tetrahydro-1H-indol-2-ylm...)
Show SMILES O=C1Nc2cc(ccc2\C1=C\c1cc2CCCCc2[nH]1)-c1ccccc1
Show InChI InChI=1S/C23H20N2O/c26-23-20(14-18-12-17-8-4-5-9-21(17)24-18)19-11-10-16(13-22(19)25-23)15-6-2-1-3-7-15/h1-3,6-7,10-14,24H,4-5,8-9H2,(H,25,26)/b20-14-
n/an/a>1.00E+5n/an/an/an/an/an/a
SUGEN, Inc.
Assay Description
IC50 is the inhibitor concentration which inhibits 50% of EGF-R or PDGFR-beta kinase autophosphorylation activity. The assay was performed in 96-well...
J Med Chem 43: 2655-63 (2000)
Article DOI: 10.1021/jm9906116
BindingDB Entry DOI: 10.7270/Q2W66J0N
Platelet-derived growth factor receptor beta
(Homo sapiens (Human))
BDBM4909
((3Z)-6-phenyl-3-(4,5,6,7-tetrahydro-1H-indol-2-ylm...)
Show SMILES O=C1Nc2cc(ccc2\C1=C\c1cc2CCCCc2[nH]1)-c1ccccc1
Show InChI InChI=1S/C23H20N2O/c26-23-20(14-18-12-17-8-4-5-9-21(17)24-18)19-11-10-16(13-22(19)25-23)15-6-2-1-3-7-15/h1-3,6-7,10-14,24H,4-5,8-9H2,(H,25,26)/b20-14-
NCI pathway
Reactome pathway
n/an/a 7.06E+4n/an/an/an/an/an/a
SUGEN, Inc.
Assay Description
IC50 is the inhibitor concentration which inhibits 50% of EGF-R or PDGFR-beta kinase autophosphorylation activity. The assay was performed in 96-well...
J Med Chem 43: 2655-63 (2000)
Article DOI: 10.1021/jm9906116
BindingDB Entry DOI: 10.7270/Q2W66J0N
Proto-oncogene tyrosine-protein kinase Src
(Homo sapiens (Human))
BDBM4909
((3Z)-6-phenyl-3-(4,5,6,7-tetrahydro-1H-indol-2-ylm...)
Show SMILES O=C1Nc2cc(ccc2\C1=C\c1cc2CCCCc2[nH]1)-c1ccccc1
Show InChI InChI=1S/C23H20N2O/c26-23-20(14-18-12-17-8-4-5-9-21(17)24-18)19-11-10-16(13-22(19)25-23)15-6-2-1-3-7-15/h1-3,6-7,10-14,24H,4-5,8-9H2,(H,25,26)/b20-14-
n/an/a>2.00E+4n/an/an/an/an/an/a
SUGEN, Inc.
Assay Description
The assays were performed in 96-well microtiter plates that had been coated with a polyGluTyr peptide. Negative control wells received buffer alone w...
J Med Chem 43: 2655-63 (2000)
Article DOI: 10.1021/jm9906116
BindingDB Entry DOI: 10.7270/Q2W66J0N