BDBM4915 3-(2-{[(3Z)-5-bromo-2-oxo-2,3-dihydro-1H-indol-3-ylidene]methyl}-4,5,6,7-tetrahydro-1H-indol-3-yl)propanoic acid::3-[2-(5-Bromo-2-oxo-1,2-dihydroindol-3-ylidenemethyl)-4,5,6,7-tetrahydro-1H-indol-3-yl]propionic Acid::Indolin-2-one deriv. 9b
SMILES: OC(=O)CCc1c(\C=C2/C(=O)Nc3ccc(Br)cc23)[nH]c2CCCCc12
InChI Key: InChIKey=OICXIBPVOXVRBW-GDNBJRDFSA-N
Data: 5 IC50
Activity Spreadsheet -- Enzyme Inhibition Constant Data from BindingDB
Found 5 hits for monomerid = 4915
Trg + Lig
Ki
nM
ΔG°
kcal/mole
IC50
nM
Kd
nM
EC50/IC50
nM
koff
s-1
kon
M-1s-1
pHTemp
°C
Vascular endothelial growth factor receptor 2
(Homo sapiens (Human))
BDBM4915
(3-(2-{[(3Z)-5-bromo-2-oxo-2,3-dihydro-1H-indol-3-y...)
Show SMILES OC(=O)CCc1c(\C=C2/C(=O)Nc3ccc(Br)cc23)[nH]c2CCCCc12
Show InChI InChI=1S/C20H19BrN2O3/c21-11-5-7-17-14(9-11)15(20(26)23-17)10-18-13(6-8-19(24)25)12-3-1-2-4-16(12)22-18/h5,7,9-10,22H,1-4,6,8H2,(H,23,26)(H,24,25)/b15-10-
NCI pathway
Reactome pathway
n/an/a 30n/an/an/an/a7.522
SUGEN, Inc.
Assay Description
The assays were performed in 96-well microtiter plates that had been coated with a polyGluTyr peptide. Negative control wells received buffer alone w...
J Med Chem 43: 2655-63 (2000)
Article DOI: 10.1021/jm9906116
BindingDB Entry DOI: 10.7270/Q2W66J0N
Fibroblast growth factor receptor 1
(Homo sapiens (Human))
BDBM4915
(3-(2-{[(3Z)-5-bromo-2-oxo-2,3-dihydro-1H-indol-3-y...)
Show SMILES OC(=O)CCc1c(\C=C2/C(=O)Nc3ccc(Br)cc23)[nH]c2CCCCc12
Show InChI InChI=1S/C20H19BrN2O3/c21-11-5-7-17-14(9-11)15(20(26)23-17)10-18-13(6-8-19(24)25)12-3-1-2-4-16(12)22-18/h5,7,9-10,22H,1-4,6,8H2,(H,23,26)(H,24,25)/b15-10-
NCI pathway
Reactome pathway
n/an/a 270n/an/an/an/an/an/a
SUGEN, Inc.
Assay Description
The assays were performed in 96-well microtiter plates that had been coated with a polyGluTyr peptide. Negative control wells received buffer alone w...
J Med Chem 43: 2655-63 (2000)
Article DOI: 10.1021/jm9906116
BindingDB Entry DOI: 10.7270/Q2W66J0N
Epidermal growth factor receptor
(Homo sapiens (Human))
BDBM4915
(3-(2-{[(3Z)-5-bromo-2-oxo-2,3-dihydro-1H-indol-3-y...)
Show SMILES OC(=O)CCc1c(\C=C2/C(=O)Nc3ccc(Br)cc23)[nH]c2CCCCc12
Show InChI InChI=1S/C20H19BrN2O3/c21-11-5-7-17-14(9-11)15(20(26)23-17)10-18-13(6-8-19(24)25)12-3-1-2-4-16(12)22-18/h5,7,9-10,22H,1-4,6,8H2,(H,23,26)(H,24,25)/b15-10-
n/an/a>1.00E+5n/an/an/an/an/an/a
SUGEN, Inc.
Assay Description
IC50 is the inhibitor concentration which inhibits 50% of EGF-R or PDGFR-beta kinase autophosphorylation activity. The assay was performed in 96-well...
J Med Chem 43: 2655-63 (2000)
Article DOI: 10.1021/jm9906116
BindingDB Entry DOI: 10.7270/Q2W66J0N
Platelet-derived growth factor receptor beta
(Homo sapiens (Human))
BDBM4915
(3-(2-{[(3Z)-5-bromo-2-oxo-2,3-dihydro-1H-indol-3-y...)
Show SMILES OC(=O)CCc1c(\C=C2/C(=O)Nc3ccc(Br)cc23)[nH]c2CCCCc12
Show InChI InChI=1S/C20H19BrN2O3/c21-11-5-7-17-14(9-11)15(20(26)23-17)10-18-13(6-8-19(24)25)12-3-1-2-4-16(12)22-18/h5,7,9-10,22H,1-4,6,8H2,(H,23,26)(H,24,25)/b15-10-
NCI pathway
Reactome pathway
n/an/a 4n/an/an/an/an/an/a
SUGEN, Inc.
Assay Description
IC50 is the inhibitor concentration which inhibits 50% of EGF-R or PDGFR-beta kinase autophosphorylation activity. The assay was performed in 96-well...
J Med Chem 43: 2655-63 (2000)
Article DOI: 10.1021/jm9906116
BindingDB Entry DOI: 10.7270/Q2W66J0N
Proto-oncogene tyrosine-protein kinase Src
(Homo sapiens (Human))
BDBM4915
(3-(2-{[(3Z)-5-bromo-2-oxo-2,3-dihydro-1H-indol-3-y...)
Show SMILES OC(=O)CCc1c(\C=C2/C(=O)Nc3ccc(Br)cc23)[nH]c2CCCCc12
Show InChI InChI=1S/C20H19BrN2O3/c21-11-5-7-17-14(9-11)15(20(26)23-17)10-18-13(6-8-19(24)25)12-3-1-2-4-16(12)22-18/h5,7,9-10,22H,1-4,6,8H2,(H,23,26)(H,24,25)/b15-10-
n/an/a 1.27E+3n/an/an/an/an/an/a
SUGEN, Inc.
Assay Description
The assays were performed in 96-well microtiter plates that had been coated with a polyGluTyr peptide. Negative control wells received buffer alone w...
J Med Chem 43: 2655-63 (2000)
Article DOI: 10.1021/jm9906116
BindingDB Entry DOI: 10.7270/Q2W66J0N