BDBM50000164 CHEMBL405583::Ribonucleotide reductase inhibiting peptide analogue
SMILES: CC[C@@H](C)[C@H](NC(=O)[C@@H](NC(=O)[C@@H](NC(=O)CNC(=O)[C@@H](NC(=O)[C@H](Cc1ccc(O)cc1)NC(C)=O)C(C)C)[C@@H](C)O)C(C)C)C(=O)N[C@@H](CC(N)=O)C(=O)N[C@@H](CC(O)=O)C(=O)N[C@@H](CC(C)C)C(O)=O
InChI Key: InChIKey=FYYVMJCWFIRJQB-VWVOTPFLSA-N
Data: 1 IC50
Activity Spreadsheet -- Enzyme Inhibition Constant Data from BindingDB
Found 1 hit for monomerid = 50000164
Trg + Lig
Ki
nM
ΔG°
kcal/mole
IC50
nM
Kd
nM
EC50/IC50
nM
koff
s-1
kon
M-1s-1
pHTemp
°C
Ribonucleoside-diphosphate reductase large subunit
(Homo sapiens (Human))
BDBM50000164
(CHEMBL405583 | Ribonucleotide reductase inhibiting...)
Show SMILES CC[C@@H](C)[C@H](NC(=O)[C@@H](NC(=O)[C@@H](NC(=O)CNC(=O)[C@@H](NC(=O)[C@H](Cc1ccc(O)cc1)NC(C)=O)C(C)C)[C@@H](C)O)C(C)C)C(=O)N[C@@H](CC(N)=O)C(=O)N[C@@H](CC(O)=O)C(=O)N[C@@H](CC(C)C)C(O)=O
Show InChI InChI=1S/C47H74N10O16/c1-11-24(8)38(45(70)52-30(18-33(48)61)40(65)51-31(19-35(63)64)41(66)53-32(47(72)73)16-21(2)3)57-44(69)37(23(6)7)56-46(71)39(25(9)58)54-34(62)20-49-43(68)36(22(4)5)55-42(67)29(50-26(10)59)17-27-12-14-28(60)15-13-27/h12-15,21-25,29-32,36-39,58,60H,11,16-20H2,1-10H3,(H2,48,61)(H,49,68)(H,50,59)(H,51,65)(H,52,70)(H,53,66)(H,54,62)(H,55,67)(H,56,71)(H,57,69)(H,63,64)(H,72,73)/t24-,25-,29+,30+,31+,32+,36+,37+,38+,39+/m1/s1
NCI pathway
Reactome pathway
n/an/a 4.20E+3n/an/an/an/an/an/a
Notre-Dame Hospital Research
Curated by ChEMBL
Assay Description
Inhibitory concentaration against HSV-1 ribonucleotide reductase R1 protein binding
J Med Chem 35: 346-50 (1992)
BindingDB Entry DOI: 10.7270/Q2348JB2