BDBM50000258 CHEMBL3228382
SMILES: Br.CCN1CCCSC1=N
InChI Key: InChIKey=SAHCAQUDULQVCN-UHFFFAOYSA-N
Data: 2 IC50
Activity Spreadsheet -- Enzyme Inhibition Constant Data from BindingDB
Found 2 hits for monomerid = 50000258
Trg + Lig
Ki
nM
ΔG°
kcal/mole
IC50
nM
Kd
nM
EC50/IC50
nM
koff
s-1
kon
M-1s-1
pHTemp
°C
Indolethylamine N-methyltransferase
(Homo sapiens (Human))
BDBM50000258
(CHEMBL3228382)
Show SMILES Br.CCN1CCCSC1=N
Show InChI InChI=1S/C6H12N2S.BrH/c1-2-8-4-3-5-9-6(8)7;/h7H,2-5H2,1H3;1H
n/an/a 9.90E+3n/an/an/an/an/an/a
TBA
Curated by ChEMBL
Assay Description
Inhibition of human lung INMT using N-methyltryptamine as substrate after 60 to 90 mins by liquid scintillation counting in presence of S-methyl-[14C...
J Med Chem 22: 237-47 (1979)
BindingDB Entry DOI: 10.7270/Q28S4RFG
Indolethylamine N-methyltransferase
(Oryctolagus cuniculus)
BDBM50000258
(CHEMBL3228382)
Show SMILES Br.CCN1CCCSC1=N
Show InChI InChI=1S/C6H12N2S.BrH/c1-2-8-4-3-5-9-6(8)7;/h7H,2-5H2,1H3;1H
n/an/a 1.80E+3n/an/an/an/an/an/a
TBA
Curated by ChEMBL
Assay Description
Inhibition of New Zealand white rabbit lung INMT using N-methyltryptamine as substrate after 60 to 90 mins by liquid scintillation counting in presen...
J Med Chem 22: 237-47 (1979)
BindingDB Entry DOI: 10.7270/Q28S4RFG