BDBM50000279 1-[2-(3,4-Dichloro-phenyl)-acetyl]-6-pyrrolidin-1-ylmethyl-piperidine-3-carboxylic acid amide::CHEMBL146533
SMILES: NC(=O)[C@H]1CC[C@@H](CN2CCCC2)N(C1)C(=O)Cc1ccc(Cl)c(Cl)c1
InChI Key: InChIKey=UMUDYAVGHCJDAV-GJZGRUSLSA-N
Data: 1 IC50
Activity Spreadsheet -- Enzyme Inhibition Constant Data from BindingDB
Found 1 hit for monomerid = 50000279
Trg + Lig
Ki
nM
ΔG°
kcal/mole
IC50
nM
Kd
nM
EC50/IC50
nM
koff
s-1
kon
M-1s-1
pHTemp
°C
Kappa-type opioid receptor
(Homo sapiens (Human))
BDBM50000279
(1-[2-(3,4-Dichloro-phenyl)-acetyl]-6-pyrrolidin-1-...)
Show SMILES NC(=O)[C@H]1CC[C@@H](CN2CCCC2)N(C1)C(=O)Cc1ccc(Cl)c(Cl)c1
Show InChI InChI=1S/C19H25Cl2N3O2/c20-16-6-3-13(9-17(16)21)10-18(25)24-11-14(19(22)26)4-5-15(24)12-23-7-1-2-8-23/h3,6,9,14-15H,1-2,4-5,7-8,10-12H2,(H2,22,26)/t14-,15-/m0/s1
Reactome pathway
n/an/a>1.00E+4n/an/an/an/an/an/a
Glaxo Group Research Ltd.
Curated by ChEMBL
Assay Description
Opioid receptor kappa 1 agonist potency was determined in vitro using rabbit vas deferens (LVD) preparation
J Med Chem 35: 490-501 (1992)
BindingDB Entry DOI: 10.7270/Q2TQ60GV