BDBM50000292 2-(3,4-Dichloro-phenyl)-1-[2-(2,5-dihydro-pyrrol-1-ylmethyl)-piperidin-1-yl]-ethanone::CHEMBL343246
SMILES: Clc1ccc(CC(=O)N2CCCCC2CN2CC=CC2)cc1Cl
InChI Key: InChIKey=MKUSUAHBXSHVJF-UHFFFAOYSA-N
Data: 1 IC50
Activity Spreadsheet -- Enzyme Inhibition Constant Data from BindingDB
Found 1 hit for monomerid = 50000292
Trg + Lig
Ki
nM
ΔG°
kcal/mole
IC50
nM
Kd
nM
EC50/IC50
nM
koff
s-1
kon
M-1s-1
pHTemp
°C
Kappa-type opioid receptor
(Homo sapiens (Human))
BDBM50000292
(2-(3,4-Dichloro-phenyl)-1-[2-(2,5-dihydro-pyrrol-1...)
Show SMILES Clc1ccc(CC(=O)N2CCCCC2CN2CC=CC2)cc1Cl |c:18|
Show InChI InChI=1S/C18H22Cl2N2O/c19-16-7-6-14(11-17(16)20)12-18(23)22-10-2-1-5-15(22)13-21-8-3-4-9-21/h3-4,6-7,11,15H,1-2,5,8-10,12-13H2
Reactome pathway
n/an/a 3.5n/an/an/an/an/an/a
Glaxo Group Research Ltd.
Curated by ChEMBL
Assay Description
Opioid receptor kappa 1 agonist potency of the compound was determined in vitro using rabbit vas deferens(LVD) preparation
J Med Chem 35: 490-501 (1992)
BindingDB Entry DOI: 10.7270/Q2TQ60GV