BDBM50000311 CHEMBL3228390
SMILES: I.Cn1cccc\c1=N/CCO
InChI Key: InChIKey=ARSNTBLMFJBITG-HRNDJLQDSA-N
Data: 1 IC50
Activity Spreadsheet -- Enzyme Inhibition Constant Data from BindingDB
Found 1 hit for monomerid = 50000311
Trg + Lig
Ki
nM
ΔG°
kcal/mole
IC50
nM
Kd
nM
EC50/IC50
nM
koff
s-1
kon
M-1s-1
pHTemp
°C
Indolethylamine N-methyltransferase
(Oryctolagus cuniculus)
BDBM50000311
(CHEMBL3228390)
Show SMILES I.Cn1cccc\c1=N/CCO
Show InChI InChI=1S/C8H12N2O.HI/c1-10-6-3-2-4-8(10)9-5-7-11;/h2-4,6,11H,5,7H2,1H3;1H/b9-8+;
n/an/a>8.90E+3n/an/an/an/an/an/a
TBA
Curated by ChEMBL
Assay Description
Inhibition of New Zealand white rabbit lung INMT using N-methyltryptamine as substrate after 60 to 90 mins by liquid scintillation counting in presen...
J Med Chem 22: 237-47 (1979)
BindingDB Entry DOI: 10.7270/Q28S4RFG