BDBM50000321 CHEMBL3228397
SMILES: OC(=O)C(O)=O.Cn1c(N)cccc1=N
InChI Key: InChIKey=LJBFSRREGFXHJY-UHFFFAOYSA-N
Data: 1 IC50
Activity Spreadsheet -- Enzyme Inhibition Constant Data from BindingDB
Found 1 hit for monomerid = 50000321
Trg + Lig
Ki
nM
ΔG°
kcal/mole
IC50
nM
Kd
nM
EC50/IC50
nM
koff
s-1
kon
M-1s-1
pHTemp
°C
Indolethylamine N-methyltransferase
(Oryctolagus cuniculus)
BDBM50000321
(CHEMBL3228397)
Show SMILES OC(=O)C(O)=O.Cn1c(N)cccc1=N
Show InChI InChI=1S/C6H9N3.C2H2O4/c1-9-5(7)3-2-4-6(9)8;3-1(4)2(5)6/h2-4,7H,8H2,1H3;(H,3,4)(H,5,6)
n/an/a 6.20E+3n/an/an/an/an/an/a
TBA
Curated by ChEMBL
Assay Description
Inhibition of New Zealand white rabbit lung INMT using N-methyltryptamine as substrate after 60 to 90 mins by liquid scintillation counting in presen...
J Med Chem 22: 237-47 (1979)
BindingDB Entry DOI: 10.7270/Q28S4RFG