BDBM50000384 Acetic acid 1-(2-dimethylamino-ethyl)-6-methoxy-4-(4-methoxy-phenyl)-2-oxo-2,3,4,5-tetrahydro-1H-benzo[b]azepin-3-yl ester::CHEMBL165217
SMILES: COc1ccc(cc1)[C@@H]1Cc2c(OC)cccc2N(CCN(C)C)C(=O)[C@@H]1OC(C)=O
InChI Key: InChIKey=GWUJJNKHFAVIBE-WMZHIEFXSA-N
Data: 1 Kd
Activity Spreadsheet -- Enzyme Inhibition Constant Data from BindingDB
Found 1 hit for monomerid = 50000384
Trg + Lig
Ki
nM
ΔG°
kcal/mole
IC50
nM
Kd
nM
EC50/IC50
nM
koff
s-1
kon
M-1s-1
pHTemp
°C
Voltage-gated L-type calcium channel
(Homo sapiens (Human))
BDBM50000384
(Acetic acid 1-(2-dimethylamino-ethyl)-6-methoxy-4-...)
Show SMILES COc1ccc(cc1)[C@@H]1Cc2c(OC)cccc2N(CCN(C)C)C(=O)[C@@H]1OC(C)=O
Show InChI InChI=1S/C24H30N2O5/c1-16(27)31-23-19(17-9-11-18(29-4)12-10-17)15-20-21(7-6-8-22(20)30-5)26(24(23)28)14-13-25(2)3/h6-12,19,23H,13-15H2,1-5H3/t19-,23+/m0/s1
Reactome pathway
n/an/an/a 1.80E+3n/an/an/an/an/a
Bristol-Myers Squibb Pharmaceutical Research Institute
Curated by ChEMBL
Assay Description
In vitro ability to displace the specific binding of [3H]-diltiazem to diltiazem receptor in guinea pig skeletal muscle.
J Med Chem 35: 780-93 (1992)
BindingDB Entry DOI: 10.7270/Q2K64H14