BDBM50000565 (S)-3-{(S)-2-[(S)-2-Amino-3-(3H-imidazol-4-yl)-propionylamino]-4-methyl-pentanoylamino}-N-((S)-1-{(S)-1-[(S)-1-carboxy-2-(1H-indol-3-yl)-ethylcarbamoyl]-2-methyl-butylcarbamoyl}-2-methyl-butyl)-succinamic acid::3-{2-[2-Amino-3-(3H-imidazol-4-yl)-propionylamino]-4-methyl-pentanoylamino}-N-(1-{1-[1-carboxy-2-(1H-indol-3-yl)-ethylcarbamoyl]-2-methyl-butylcarbamoyl}-2-methyl-butyl)-succinamic acid::CHEMBL34540
SMILES: CC[C@H](C)[C@H](NC(=O)[C@@H](NC(=O)[C@H](CC(O)=O)NC(=O)[C@H](CC(C)C)NC(=O)[C@@H](N)Cc1cnc[nH]1)[C@@H](C)CC)C(=O)N[C@@H](Cc1c[nH]c2ccccc12)C(O)=O
InChI Key: InChIKey=NTSBFTNRWQVBCA-IVGDYKFASA-N
Data: 3 IC50
Activity Spreadsheet -- Enzyme Inhibition Constant Data from BindingDB
Found 3 hits for monomerid = 50000565
Trg + Lig
Ki
nM
ΔG°
kcal/mole
IC50
nM
Kd
nM
EC50/IC50
nM
koff
s-1
kon
M-1s-1
pHTemp
°C
EDNRB
(RAT)
BDBM50000565
((S)-3-{(S)-2-[(S)-2-Amino-3-(3H-imidazol-4-yl)-pro...)
Show SMILES CC[C@H](C)[C@H](NC(=O)[C@@H](NC(=O)[C@H](CC(O)=O)NC(=O)[C@H](CC(C)C)NC(=O)[C@@H](N)Cc1cnc[nH]1)[C@@H](C)CC)C(=O)N[C@@H](Cc1c[nH]c2ccccc12)C(O)=O
Show InChI InChI=1S/C39H57N9O9/c1-7-21(5)32(37(54)46-30(39(56)57)14-23-17-42-27-12-10-9-11-25(23)27)48-38(55)33(22(6)8-2)47-36(53)29(16-31(49)50)45-35(52)28(13-20(3)4)44-34(51)26(40)15-24-18-41-19-43-24/h9-12,17-22,26,28-30,32-33,42H,7-8,13-16,40H2,1-6H3,(H,41,43)(H,44,51)(H,45,52)(H,46,54)(H,47,53)(H,48,55)(H,49,50)(H,56,57)/t21-,22-,26-,28-,29-,30-,32-,33-/m0/s1
Reactome pathway
n/an/a>5.00E+4n/an/an/an/an/an/a
TBA
Curated by ChEMBL
Assay Description
Inhibition of [125I]-endothelin-3 [ET-3] binding to endothelin B receptor (ETB) of rat cerebellum
Bioorg Med Chem Lett 5: 967-972 (1995)
Article DOI: 10.1016/0960-894X(95)00152-J
BindingDB Entry DOI: 10.7270/Q2MG7PZH
EDNRA
(RAT)
BDBM50000565
((S)-3-{(S)-2-[(S)-2-Amino-3-(3H-imidazol-4-yl)-pro...)
Show SMILES CC[C@H](C)[C@H](NC(=O)[C@@H](NC(=O)[C@H](CC(O)=O)NC(=O)[C@H](CC(C)C)NC(=O)[C@@H](N)Cc1cnc[nH]1)[C@@H](C)CC)C(=O)N[C@@H](Cc1c[nH]c2ccccc12)C(O)=O
Show InChI InChI=1S/C39H57N9O9/c1-7-21(5)32(37(54)46-30(39(56)57)14-23-17-42-27-12-10-9-11-25(23)27)48-38(55)33(22(6)8-2)47-36(53)29(16-31(49)50)45-35(52)28(13-20(3)4)44-34(51)26(40)15-24-18-41-19-43-24/h9-12,17-22,26,28-30,32-33,42H,7-8,13-16,40H2,1-6H3,(H,41,43)(H,44,51)(H,45,52)(H,46,54)(H,47,53)(H,48,55)(H,49,50)(H,56,57)/t21-,22-,26-,28-,29-,30-,32-,33-/m0/s1
Reactome pathway
n/an/a 4.40E+4n/an/an/an/an/an/a
Warner-Lambert Company
Curated by ChEMBL
Assay Description
Compound was evaluated for the binding affinity to endothelin receptor in the rat heart ventricle.
J Med Chem 35: 1493-508 (1992)
BindingDB Entry DOI: 10.7270/Q27M08KX
Endothelin-1 receptor
(Homo sapiens (Human))
BDBM50000565
((S)-3-{(S)-2-[(S)-2-Amino-3-(3H-imidazol-4-yl)-pro...)
Show SMILES CC[C@H](C)[C@H](NC(=O)[C@@H](NC(=O)[C@H](CC(O)=O)NC(=O)[C@H](CC(C)C)NC(=O)[C@@H](N)Cc1cnc[nH]1)[C@@H](C)CC)C(=O)N[C@@H](Cc1c[nH]c2ccccc12)C(O)=O
Show InChI InChI=1S/C39H57N9O9/c1-7-21(5)32(37(54)46-30(39(56)57)14-23-17-42-27-12-10-9-11-25(23)27)48-38(55)33(22(6)8-2)47-36(53)29(16-31(49)50)45-35(52)28(13-20(3)4)44-34(51)26(40)15-24-18-41-19-43-24/h9-12,17-22,26,28-30,32-33,42H,7-8,13-16,40H2,1-6H3,(H,41,43)(H,44,51)(H,45,52)(H,46,54)(H,47,53)(H,48,55)(H,49,50)(H,56,57)/t21-,22-,26-,28-,29-,30-,32-,33-/m0/s1
n/an/a>5.00E+4n/an/an/an/an/an/a
TBA
Curated by ChEMBL
Assay Description
Inhibition of [125I]endothelin-1 [ET-1] binding to endothelin A receptor (ETA) of rabbit renal artery vascular smooth muscle cells
Bioorg Med Chem Lett 5: 967-972 (1995)
Article DOI: 10.1016/0960-894X(95)00152-J
BindingDB Entry DOI: 10.7270/Q2MG7PZH