BDBM50000857 2-(1-methoxy-1-(3-(naphthalen-2-ylmethoxy)phenyl)propyl)thiazole::2-{1-Methoxy-1-[3-(naphthalen-2-ylmethoxy)-phenyl]-propyl}-thiazole::CHEMBL423835::ICI-211965
SMILES: CCC(OC)(c1nccs1)c1cccc(OCc2ccc3ccccc3c2)c1
InChI Key: InChIKey=XYRDHZXSQUWVCD-UHFFFAOYSA-N
Data: 7 IC50
Activity Spreadsheet -- Enzyme Inhibition Constant Data from BindingDB
Found 7 hits for monomerid = 50000857
Trg + Lig
Ki
nM
ΔG°
kcal/mole
IC50
nM
Kd
nM
EC50/IC50
nM
koff
s-1
kon
M-1s-1
pHTemp
°C
Arachidonate 5-lipoxygenase
(Rattus norvegicus)
BDBM50000857
(2-(1-methoxy-1-(3-(naphthalen-2-ylmethoxy)phenyl)p...)
Show SMILES CCC(OC)(c1nccs1)c1cccc(OCc2ccc3ccccc3c2)c1
Show InChI InChI=1S/C24H23NO2S/c1-3-24(26-2,23-25-13-14-28-23)21-9-6-10-22(16-21)27-17-18-11-12-19-7-4-5-8-20(19)15-18/h4-16H,3,17H2,1-2H3
n/an/a 500n/an/an/an/an/an/a
ICI Pharmaceuticals
Curated by ChEMBL
Assay Description
Compound was tested for the inhibition of 5-lipoxygenase (5-Lpo) in rat whole blood.
J Med Chem 34: 2176-86 (1991)
BindingDB Entry DOI: 10.7270/Q2S46QX6
Arachidonate 5-lipoxygenase
(Homo sapiens (Human))
BDBM50000857
(2-(1-methoxy-1-(3-(naphthalen-2-ylmethoxy)phenyl)p...)
Show SMILES CCC(OC)(c1nccs1)c1cccc(OCc2ccc3ccccc3c2)c1
Show InChI InChI=1S/C24H23NO2S/c1-3-24(26-2,23-25-13-14-28-23)21-9-6-10-22(16-21)27-17-18-11-12-19-7-4-5-8-20(19)15-18/h4-16H,3,17H2,1-2H3
Reactome pathway
n/an/a 100n/an/an/an/an/an/a
ICI Pharmaceuticals
Curated by ChEMBL
Assay Description
Compound was tested for the inhibition of 5-lipoxygenase (5-Lpo) in guinea pig.
J Med Chem 34: 2176-86 (1991)
BindingDB Entry DOI: 10.7270/Q2S46QX6
Arachidonate 5-lipoxygenase
(Mus musculus)
BDBM50000857
(2-(1-methoxy-1-(3-(naphthalen-2-ylmethoxy)phenyl)p...)
Show SMILES CCC(OC)(c1nccs1)c1cccc(OCc2ccc3ccccc3c2)c1
Show InChI InChI=1S/C24H23NO2S/c1-3-24(26-2,23-25-13-14-28-23)21-9-6-10-22(16-21)27-17-18-11-12-19-7-4-5-8-20(19)15-18/h4-16H,3,17H2,1-2H3
n/an/a 8n/an/an/an/an/an/a
ICI Pharmaceuticals
Curated by ChEMBL
Assay Description
Inhibition of 5-lipoxygenase in mouse macrophages.
J Med Chem 34: 2176-86 (1991)
BindingDB Entry DOI: 10.7270/Q2S46QX6
Arachidonate 5-lipoxygenase
(Homo sapiens (Human))
BDBM50000857
(2-(1-methoxy-1-(3-(naphthalen-2-ylmethoxy)phenyl)p...)
Show SMILES CCC(OC)(c1nccs1)c1cccc(OCc2ccc3ccccc3c2)c1
Show InChI InChI=1S/C24H23NO2S/c1-3-24(26-2,23-25-13-14-28-23)21-9-6-10-22(16-21)27-17-18-11-12-19-7-4-5-8-20(19)15-18/h4-16H,3,17H2,1-2H3
Reactome pathway
n/an/a 400n/an/an/an/an/an/a
ICI Pharmaceuticals
Curated by ChEMBL
Assay Description
In vitro inhibition of leukotriene B4 synthesis in human whole blood by inhibiting 5-lipoxygenase
J Med Chem 35: 2600-9 (1992)
BindingDB Entry DOI: 10.7270/Q2Q240VJ
Arachidonate 5-lipoxygenase
(Homo sapiens (Human))
BDBM50000857
(2-(1-methoxy-1-(3-(naphthalen-2-ylmethoxy)phenyl)p...)
Show SMILES CCC(OC)(c1nccs1)c1cccc(OCc2ccc3ccccc3c2)c1
Show InChI InChI=1S/C24H23NO2S/c1-3-24(26-2,23-25-13-14-28-23)21-9-6-10-22(16-21)27-17-18-11-12-19-7-4-5-8-20(19)15-18/h4-16H,3,17H2,1-2H3
Reactome pathway
n/an/a 150n/an/an/an/an/an/a
Merck Frosst Centre for Therapeutic Research
Curated by ChEMBL
Assay Description
In vitro potency against human 5-Lipoxygenase
J Med Chem 37: 512-8 (1994)
BindingDB Entry DOI: 10.7270/Q2J965FV
Arachidonate 5-lipoxygenase
(Homo sapiens (Human))
BDBM50000857
(2-(1-methoxy-1-(3-(naphthalen-2-ylmethoxy)phenyl)p...)
Show SMILES CCC(OC)(c1nccs1)c1cccc(OCc2ccc3ccccc3c2)c1
Show InChI InChI=1S/C24H23NO2S/c1-3-24(26-2,23-25-13-14-28-23)21-9-6-10-22(16-21)27-17-18-11-12-19-7-4-5-8-20(19)15-18/h4-16H,3,17H2,1-2H3
Reactome pathway
n/an/a 400n/an/an/an/an/an/a
Centre de Recherches
Curated by ChEMBL
Assay Description
Inhibition of 5-lipoxygenase from human whole blood
J Med Chem 37: 113-24 (1994)
BindingDB Entry DOI: 10.7270/Q2JW8CZP
Arachidonate 5-lipoxygenase
(Homo sapiens (Human))
BDBM50000857
(2-(1-methoxy-1-(3-(naphthalen-2-ylmethoxy)phenyl)p...)
Show SMILES CCC(OC)(c1nccs1)c1cccc(OCc2ccc3ccccc3c2)c1
Show InChI InChI=1S/C24H23NO2S/c1-3-24(26-2,23-25-13-14-28-23)21-9-6-10-22(16-21)27-17-18-11-12-19-7-4-5-8-20(19)15-18/h4-16H,3,17H2,1-2H3
Reactome pathway
n/an/a 400n/an/an/an/an/an/a
ICI Pharmaceuticals
Curated by ChEMBL
Assay Description
Inhibition of 5-lipoxygenase in human whole blood.
J Med Chem 34: 2176-86 (1991)
BindingDB Entry DOI: 10.7270/Q2S46QX6