BDBM50000913 7-(2,3-Dihydroxy-propoxy)-1,3-dihydro-imidazo[4,5-b]quinolin-2-one(HCl)::CHEMBL314763
SMILES: OCC(O)COc1ccc2nc3[nH]c(=O)[nH]c3cc2c1
InChI Key: InChIKey=WEBZYVCZQWRSBX-UHFFFAOYSA-N
Data: 1 IC50  2 EC50
Activity Spreadsheet -- Enzyme Inhibition Constant Data from BindingDB
Found 3 hits for monomerid = 50000913
Trg + Lig
Ki
nM
ΔG°
kcal/mole
IC50
nM
Kd
nM
EC50/IC50
nM
koff
s-1
kon
M-1s-1
pHTemp
°C
Purinergic receptor P2Y12
(Homo sapiens (Human))
BDBM50000913
(7-(2,3-Dihydroxy-propoxy)-1,3-dihydro-imidazo[4,5-...)
Show SMILES OCC(O)COc1ccc2nc3[nH]c(=O)[nH]c3cc2c1
Show InChI InChI=1S/C13H13N3O4/c17-5-8(18)6-20-9-1-2-10-7(3-9)4-11-12(14-10)16-13(19)15-11/h1-4,8,17-18H,5-6H2,(H2,14,15,16,19)
Reactome pathway
n/an/an/an/a 1.19E+4n/an/an/an/a
Bristol-Myers Squibb Pharmaceutical Research Institute
Curated by ChEMBL
Assay Description
Inhibition of platelet aggregation using Adenosine diphosphate (ADP) as activating agent in rabbit platelet rich plasma (PRP)
J Med Chem 35: 2672-87 (1992)
BindingDB Entry DOI: 10.7270/Q2513X52
Purinergic receptor P2Y12
(Homo sapiens (Human))
BDBM50000913
(7-(2,3-Dihydroxy-propoxy)-1,3-dihydro-imidazo[4,5-...)
Show SMILES OCC(O)COc1ccc2nc3[nH]c(=O)[nH]c3cc2c1
Show InChI InChI=1S/C13H13N3O4/c17-5-8(18)6-20-9-1-2-10-7(3-9)4-11-12(14-10)16-13(19)15-11/h1-4,8,17-18H,5-6H2,(H2,14,15,16,19)
Reactome pathway
n/an/an/an/a 260n/an/an/an/a
Bristol-Myers Squibb Pharmaceutical Research Institute
Curated by ChEMBL
Assay Description
Inhibition of platelet aggregation using Adenosine diphosphate (ADP) as activating agent in rabbit platelet rich plasma (PRP)
J Med Chem 35: 2672-87 (1992)
BindingDB Entry DOI: 10.7270/Q2513X52
Phosphodiesterase 3
(Homo sapiens (Human))
BDBM50000913
(7-(2,3-Dihydroxy-propoxy)-1,3-dihydro-imidazo[4,5-...)
Show SMILES OCC(O)COc1ccc2nc3[nH]c(=O)[nH]c3cc2c1
Show InChI InChI=1S/C13H13N3O4/c17-5-8(18)6-20-9-1-2-10-7(3-9)4-11-12(14-10)16-13(19)15-11/h1-4,8,17-18H,5-6H2,(H2,14,15,16,19)
n/an/a 20n/an/an/an/an/an/a
Bristol-Myers Squibb Pharmaceutical Research Institute
Curated by ChEMBL
Assay Description
Inhibition of platelet aggregation using adenosine diphosphate (ADP) as activating agent in human platelet rich plasma (PRP)
J Med Chem 35: 2672-87 (1992)
BindingDB Entry DOI: 10.7270/Q2513X52