BDBM50000916 4-(3-Methyl-2-oxo-2,3-dihydro-1H-imidazo[4,5-b]quinolin-7-yloxy)-butyric acid methyl ester(HCl)::CHEMBL88877
SMILES: COC(=O)CCCOc1ccc2nc3n(C)c(=O)[nH]c3cc2c1
InChI Key: InChIKey=YDIXWOJNDDFCRS-UHFFFAOYSA-N
Data: 1 IC50  2 EC50
Activity Spreadsheet -- Enzyme Inhibition Constant Data from BindingDB
Found 3 hits for monomerid = 50000916
Trg + Lig
Ki
nM
ΔG°
kcal/mole
IC50
nM
Kd
nM
EC50/IC50
nM
koff
s-1
kon
M-1s-1
pHTemp
°C
Purinergic receptor P2Y12
(Homo sapiens (Human))
BDBM50000916
(4-(3-Methyl-2-oxo-2,3-dihydro-1H-imidazo[4,5-b]qui...)
Show SMILES COC(=O)CCCOc1ccc2nc3n(C)c(=O)[nH]c3cc2c1
Show InChI InChI=1S/C16H17N3O4/c1-19-15-13(18-16(19)21)9-10-8-11(5-6-12(10)17-15)23-7-3-4-14(20)22-2/h5-6,8-9H,3-4,7H2,1-2H3,(H,18,21)
Reactome pathway
n/an/an/an/a 360n/an/an/an/a
Bristol-Myers Squibb Pharmaceutical Research Institute
Curated by ChEMBL
Assay Description
Inhibition of platelet aggregation using Adenosine diphosphate (ADP) as activating agent in rabbit platelet rich plasma (PRP)
J Med Chem 35: 2672-87 (1992)
BindingDB Entry DOI: 10.7270/Q2513X52
Purinergic receptor P2Y12
(Homo sapiens (Human))
BDBM50000916
(4-(3-Methyl-2-oxo-2,3-dihydro-1H-imidazo[4,5-b]qui...)
Show SMILES COC(=O)CCCOc1ccc2nc3n(C)c(=O)[nH]c3cc2c1
Show InChI InChI=1S/C16H17N3O4/c1-19-15-13(18-16(19)21)9-10-8-11(5-6-12(10)17-15)23-7-3-4-14(20)22-2/h5-6,8-9H,3-4,7H2,1-2H3,(H,18,21)
Reactome pathway
n/an/an/an/a 2.99E+4n/an/an/an/a
Bristol-Myers Squibb Pharmaceutical Research Institute
Curated by ChEMBL
Assay Description
Inhibition of platelet aggregation using adenosine diphosphate (ADP) as activating agent in human platelet rich plasma (PRP)
J Med Chem 35: 2672-87 (1992)
BindingDB Entry DOI: 10.7270/Q2513X52
Phosphodiesterase 3
(Homo sapiens (Human))
BDBM50000916
(4-(3-Methyl-2-oxo-2,3-dihydro-1H-imidazo[4,5-b]qui...)
Show SMILES COC(=O)CCCOc1ccc2nc3n(C)c(=O)[nH]c3cc2c1
Show InChI InChI=1S/C16H17N3O4/c1-19-15-13(18-16(19)21)9-10-8-11(5-6-12(10)17-15)23-7-3-4-14(20)22-2/h5-6,8-9H,3-4,7H2,1-2H3,(H,18,21)
n/an/a 2.00E+3n/an/an/an/an/an/a
Bristol-Myers Squibb Pharmaceutical Research Institute
Curated by ChEMBL
Assay Description
Inhibition of human platelet PDE by inhibiting cyclic Adenosine monophosphate (cAMP) hydrolysis
J Med Chem 35: 2672-87 (1992)
BindingDB Entry DOI: 10.7270/Q2513X52