BDBM50001014 CHEMBL3235689
SMILES: CC[Si](CC)(c1ccc(OS(N)(=O)=O)c(C)c1)c1ccc(OS(N)(=O)=O)c(C)c1
InChI Key: InChIKey=LFCPMYIRBMPYMG-UHFFFAOYSA-N
Data: 1 IC50
Activity Spreadsheet -- Enzyme Inhibition Constant Data from BindingDB
Found 1 hit for monomerid = 50001014
Trg + Lig
Ki
nM
ΔG°
kcal/mole
IC50
nM
Kd
nM
EC50/IC50
nM
koff
s-1
kon
M-1s-1
pHTemp
°C
Steryl-sulfatase
(Homo sapiens (Human))
BDBM50001014
(CHEMBL3235689)
Show SMILES CC[Si](CC)(c1ccc(OS(N)(=O)=O)c(C)c1)c1ccc(OS(N)(=O)=O)c(C)c1
Show InChI InChI=1S/C18H26N2O6S2Si/c1-5-29(6-2,15-7-9-17(13(3)11-15)25-27(19,21)22)16-8-10-18(14(4)12-16)26-28(20,23)24/h7-12H,5-6H2,1-4H3,(H2,19,21,22)(H2,20,23,24)
n/an/a 170n/an/an/an/an/an/a
The University of Tokyo
Curated by ChEMBL
Assay Description
Inhibition of steroid sulfatase in human MCF7 cells assessed as conversion of [3H]E1S to [3H]E1 and [3H]E2 after 5 hrs by liquid scintillation counti...
Bioorg Med Chem 22: 2244-52 (2014)
Article DOI: 10.1016/j.bmc.2014.02.025
BindingDB Entry DOI: 10.7270/Q2H996QP