BDBM50001541 CHEMBL3237706
SMILES: C[C@H]1CC[C@@H](CC1)n1c2cnccc2c2cnc(Nc3ccc(nc3)N3CCNCC3)nc12
InChI Key: InChIKey=GTQSNWXKTIFPBY-UAPYVXQJSA-N
Data: 3 IC50
Activity Spreadsheet -- Enzyme Inhibition Constant Data from BindingDB
Found 3 hits for monomerid = 50001541
Trg + Lig
Ki
nM
ΔG°
kcal/mole
IC50
nM
Kd
nM
EC50/IC50
nM
koff
s-1
kon
M-1s-1
pHTemp
°C
Cyclin-Dependent Kinase 1 (CDK1)
(Homo sapiens (Human))
BDBM50001541
(CHEMBL3237706)
Show SMILES C[C@H]1CC[C@@H](CC1)n1c2cnccc2c2cnc(Nc3ccc(nc3)N3CCNCC3)nc12 |r,wU:4.7,wD:1.0,(34.74,-35.4,;34.27,-33.94,;35.31,-32.8,;34.84,-31.33,;33.33,-31.01,;32.3,-32.15,;32.77,-33.61,;32.86,-29.55,;33.77,-28.3,;35.3,-28.14,;35.93,-26.73,;35.02,-25.48,;33.49,-25.65,;32.87,-27.05,;31.4,-27.52,;30.05,-26.75,;28.73,-27.53,;28.74,-29.06,;27.41,-29.84,;27.41,-31.38,;28.74,-32.13,;28.75,-33.66,;27.42,-34.45,;26.08,-33.68,;26.08,-32.14,;27.42,-35.99,;26.09,-36.76,;26.1,-38.29,;27.43,-39.06,;28.76,-38.29,;28.76,-36.74,;30.07,-29.83,;31.39,-29.07,)|
Show InChI InChI=1S/C25H30N8/c1-17-2-5-19(6-3-17)33-22-16-27-9-8-20(22)21-15-29-25(31-24(21)33)30-18-4-7-23(28-14-18)32-12-10-26-11-13-32/h4,7-9,14-17,19,26H,2-3,5-6,10-13H2,1H3,(H,29,30,31)/t17-,19-
Reactome pathway
n/an/a 24n/an/an/an/an/an/a
Amgen Inc.
Curated by ChEMBL
Assay Description
Inhibition of CDK1/cyclin B (unknown origin) using histone H1 as substrate after 60 mins by scintillation counting analysis in presence of [r-33P]ATP
J Med Chem 57: 3430-49 (2014)
Article DOI: 10.1021/jm500118j
BindingDB Entry DOI: 10.7270/Q2BK1DV4
Cyclin-Dependent Kinase 4 (CDK4)
(Homo sapiens (Human))
BDBM50001541
(CHEMBL3237706)
Show SMILES C[C@H]1CC[C@@H](CC1)n1c2cnccc2c2cnc(Nc3ccc(nc3)N3CCNCC3)nc12 |r,wU:4.7,wD:1.0,(34.74,-35.4,;34.27,-33.94,;35.31,-32.8,;34.84,-31.33,;33.33,-31.01,;32.3,-32.15,;32.77,-33.61,;32.86,-29.55,;33.77,-28.3,;35.3,-28.14,;35.93,-26.73,;35.02,-25.48,;33.49,-25.65,;32.87,-27.05,;31.4,-27.52,;30.05,-26.75,;28.73,-27.53,;28.74,-29.06,;27.41,-29.84,;27.41,-31.38,;28.74,-32.13,;28.75,-33.66,;27.42,-34.45,;26.08,-33.68,;26.08,-32.14,;27.42,-35.99,;26.09,-36.76,;26.1,-38.29,;27.43,-39.06,;28.76,-38.29,;28.76,-36.74,;30.07,-29.83,;31.39,-29.07,)|
Show InChI InChI=1S/C25H30N8/c1-17-2-5-19(6-3-17)33-22-16-27-9-8-20(22)21-15-29-25(31-24(21)33)30-18-4-7-23(28-14-18)32-12-10-26-11-13-32/h4,7-9,14-17,19,26H,2-3,5-6,10-13H2,1H3,(H,29,30,31)/t17-,19-
NCI pathway
Reactome pathway
n/an/a 3n/an/an/an/an/an/a
Amgen Inc.
Curated by ChEMBL
Assay Description
Inhibition of CDK4/cyclin D1 (unknown origin) using Rb as substrate after 60 mins by scintillation counting analysis in presence of [r-33P]ATP
J Med Chem 57: 3430-49 (2014)
Article DOI: 10.1021/jm500118j
BindingDB Entry DOI: 10.7270/Q2BK1DV4
Receptor-type tyrosine-protein kinase FLT3
(Homo sapiens (Human))
BDBM50001541
(CHEMBL3237706)
Show SMILES C[C@H]1CC[C@@H](CC1)n1c2cnccc2c2cnc(Nc3ccc(nc3)N3CCNCC3)nc12 |r,wU:4.7,wD:1.0,(34.74,-35.4,;34.27,-33.94,;35.31,-32.8,;34.84,-31.33,;33.33,-31.01,;32.3,-32.15,;32.77,-33.61,;32.86,-29.55,;33.77,-28.3,;35.3,-28.14,;35.93,-26.73,;35.02,-25.48,;33.49,-25.65,;32.87,-27.05,;31.4,-27.52,;30.05,-26.75,;28.73,-27.53,;28.74,-29.06,;27.41,-29.84,;27.41,-31.38,;28.74,-32.13,;28.75,-33.66,;27.42,-34.45,;26.08,-33.68,;26.08,-32.14,;27.42,-35.99,;26.09,-36.76,;26.1,-38.29,;27.43,-39.06,;28.76,-38.29,;28.76,-36.74,;30.07,-29.83,;31.39,-29.07,)|
Show InChI InChI=1S/C25H30N8/c1-17-2-5-19(6-3-17)33-22-16-27-9-8-20(22)21-15-29-25(31-24(21)33)30-18-4-7-23(28-14-18)32-12-10-26-11-13-32/h4,7-9,14-17,19,26H,2-3,5-6,10-13H2,1H3,(H,29,30,31)/t17-,19-
n/an/a 0.300n/an/an/an/an/an/a
Amgen Inc.
Curated by ChEMBL
Assay Description
Inhibition of GST-fused human FLT3 cytoplasmic domain (amino acids 564 to 993) using Ulight-JAK1 as substrate after 1 hr by TR-FRET assay
J Med Chem 57: 3430-49 (2014)
Article DOI: 10.1021/jm500118j
BindingDB Entry DOI: 10.7270/Q2BK1DV4