BDBM50002037 2-(4-Hydroxy-phenyl)-1-mercaptomethyl-ethyl-ammonium
SMILES: [NH3+]C(CS)Cc1ccc(O)cc1
InChI Key: InChIKey=GWUVRRHWGBTQHY-UHFFFAOYSA-O
Data: 1 IC50
Activity Spreadsheet -- Enzyme Inhibition Constant Data from BindingDB
Found 1 hit for monomerid = 50002037
Trg + Lig
Ki
nM
ΔG°
kcal/mole
IC50
nM
Kd
nM
EC50/IC50
nM
koff
s-1
kon
M-1s-1
pHTemp
°C
Aminopeptidase N
(Sus scrofa (Pig))
BDBM50002037
(2-(4-Hydroxy-phenyl)-1-mercaptomethyl-ethyl-ammoni...)
Show SMILES [NH3+]C(CS)Cc1ccc(O)cc1
Show InChI InChI=1S/C9H13NOS/c10-8(6-12)5-7-1-3-9(11)4-2-7/h1-4,8,11-12H,5-6,10H2/p+1
n/an/a 45n/an/an/an/an/an/a
INSERM
Curated by ChEMBL
Assay Description
Compound was tested for inhibitory potency against aminopeptidase N from hog kidney, using [3H]Leu-enkephalin as substrate
J Med Chem 35: 1259-66 (1992)
BindingDB Entry DOI: 10.7270/Q2125T81