BDBM50002190 1-Benzyl-4-(4-fluoro-benzyloxymethyl)-piperidine; compound with but-2-enedioic acid::CHEMBL136495
SMILES: Fc1ccc(COCC2CCN(Cc3ccccc3)CC2)cc1
InChI Key: InChIKey=XBBPMZNIRPSONU-UHFFFAOYSA-N
Data: 2 KI  1 IC50
Activity Spreadsheet -- Enzyme Inhibition Constant Data from BindingDB
Found 3 hits for monomerid = 50002190
Trg + Lig
Ki
nM
ΔG°
kcal/mole
IC50
nM
Kd
nM
EC50/IC50
nM
koff
s-1
kon
M-1s-1
pHTemp
°C
Sigma non-opioid intracellular receptor 1
(Mus musculus (Mouse))
BDBM50002190
(1-Benzyl-4-(4-fluoro-benzyloxymethyl)-piperidine; ...)
Show SMILES Fc1ccc(COCC2CCN(Cc3ccccc3)CC2)cc1
Show InChI InChI=1S/C20H24FNO/c21-20-8-6-18(7-9-20)15-23-16-19-10-12-22(13-11-19)14-17-4-2-1-3-5-17/h1-9,19H,10-16H2
2n/an/an/an/an/an/an/an/a
Du Pont Merck Pharmaceutical Company
Curated by ChEMBL
Assay Description
In vitro binding affinity for the mouse sigma opioid receptor
J Med Chem 35: 4344-61 (1992)
BindingDB Entry DOI: 10.7270/Q28P614G
Serotonin 2 (5-HT2) receptor
(Mus musculus (Mouse))
BDBM50002190
(1-Benzyl-4-(4-fluoro-benzyloxymethyl)-piperidine; ...)
Show SMILES Fc1ccc(COCC2CCN(Cc3ccccc3)CC2)cc1
Show InChI InChI=1S/C20H24FNO/c21-20-8-6-18(7-9-20)15-23-16-19-10-12-22(13-11-19)14-17-4-2-1-3-5-17/h1-9,19H,10-16H2
272n/an/an/an/an/an/an/an/a
Du Pont Merck Pharmaceutical Company
Curated by ChEMBL
Assay Description
In vitro binding affinity for serotonin 5-hydroxytryptamine (5-HT) 2 receptors
J Med Chem 35: 4344-61 (1992)
BindingDB Entry DOI: 10.7270/Q28P614G
D(2) dopamine receptor
(Mus musculus (Mouse))
BDBM50002190
(1-Benzyl-4-(4-fluoro-benzyloxymethyl)-piperidine; ...)
Show SMILES Fc1ccc(COCC2CCN(Cc3ccccc3)CC2)cc1
Show InChI InChI=1S/C20H24FNO/c21-20-8-6-18(7-9-20)15-23-16-19-10-12-22(13-11-19)14-17-4-2-1-3-5-17/h1-9,19H,10-16H2
n/an/a 3.90E+3n/an/an/an/an/an/a
Du Pont Merck Pharmaceutical Company
Curated by ChEMBL
Assay Description
In vitro binding affinity towards dopamine receptor D2
J Med Chem 35: 4344-61 (1992)
BindingDB Entry DOI: 10.7270/Q28P614G