null
SMILES: O=C(CC1CCN(CC2CC2)CC1)c1ccc(cc1)C#N
InChI Key: InChIKey=PEWGDLTXNPKKLN-UHFFFAOYSA-N
Activity Spreadsheet -- Enzyme Inhibition Constant Data from BindingDB
Found 6 hits for monomerid = 50002245
Trg + Lig
Ki
nM
ΔG°
kcal/mole
IC50
nM
Kd
nM
EC50/IC50
nM
koff
s-1
kon
M-1s-1
pHTemp
°C
Sigma non-opioid intracellular receptor 1
(Homo sapiens (Human))
BDBM50002245
(4-[2-(1-Cyclopropylmethyl-piperidin-4-yl)-acetyl]-...)
Show SMILES O=C(CC1CCN(CC2CC2)CC1)c1ccc(cc1)C#N
Show InChI InChI=1S/C18H22N2O/c19-12-15-3-5-17(6-4-15)18(21)11-14-7-9-20(10-8-14)13-16-1-2-16/h3-6,14,16H,1-2,7-11,13H2
10n/an/an/an/an/an/an/an/a
New York University
Curated by ChEMBL
Assay Description
Binding affinity against sigma receptor in bovine cerebellum using 2.0 nM [3H]- haloperidol
J Med Chem 36: 3923-8 (1994)
BindingDB Entry DOI: 10.7270/Q2H13122
Sigma non-opioid intracellular receptor 1
(Mus musculus (Mouse))
BDBM50002245
(4-[2-(1-Cyclopropylmethyl-piperidin-4-yl)-acetyl]-...)
Show SMILES O=C(CC1CCN(CC2CC2)CC1)c1ccc(cc1)C#N
Show InChI InChI=1S/C18H22N2O/c19-12-15-3-5-17(6-4-15)18(21)11-14-7-9-20(10-8-14)13-16-1-2-16/h3-6,14,16H,1-2,7-11,13H2
11n/an/an/an/an/an/an/an/a
Du Pont Merck Pharmaceutical Company
Curated by ChEMBL
Assay Description
In vitro binding affinity for the mouse sigma opioid receptor
J Med Chem 35: 4344-61 (1992)
BindingDB Entry DOI: 10.7270/Q28P614G
D(2) dopamine receptor
(BOVINE)
BDBM50002245
(4-[2-(1-Cyclopropylmethyl-piperidin-4-yl)-acetyl]-...)
Show SMILES O=C(CC1CCN(CC2CC2)CC1)c1ccc(cc1)C#N
Show InChI InChI=1S/C18H22N2O/c19-12-15-3-5-17(6-4-15)18(21)11-14-7-9-20(10-8-14)13-16-1-2-16/h3-6,14,16H,1-2,7-11,13H2
>1.00E+3n/an/an/an/an/an/an/an/a
New York University
Curated by ChEMBL
Assay Description
Binding affinity against Dopamine receptor D2 in bovine striatal homogenate using 200 pM [3H]- spiperone and 250 nM unlabeled ketanserin
J Med Chem 36: 3923-8 (1994)
BindingDB Entry DOI: 10.7270/Q2H13122
5-hydroxytryptamine receptor 2A/2B/2C
(Mus musculus (Mouse))
BDBM50002245
(4-[2-(1-Cyclopropylmethyl-piperidin-4-yl)-acetyl]-...)
Show SMILES O=C(CC1CCN(CC2CC2)CC1)c1ccc(cc1)C#N
Show InChI InChI=1S/C18H22N2O/c19-12-15-3-5-17(6-4-15)18(21)11-14-7-9-20(10-8-14)13-16-1-2-16/h3-6,14,16H,1-2,7-11,13H2
>1.00E+4n/an/an/an/an/an/an/an/a
Du Pont Merck Pharmaceutical Company
Curated by ChEMBL
Assay Description
In vitro binding affinity for serotonin 5-hydroxytryptamine (5-HT) 2 receptors
J Med Chem 35: 4344-61 (1992)
BindingDB Entry DOI: 10.7270/Q28P614G
D(1A) dopamine receptor
(Mus musculus (Mouse))
BDBM50002245
(4-[2-(1-Cyclopropylmethyl-piperidin-4-yl)-acetyl]-...)
Show SMILES O=C(CC1CCN(CC2CC2)CC1)c1ccc(cc1)C#N
Show InChI InChI=1S/C18H22N2O/c19-12-15-3-5-17(6-4-15)18(21)11-14-7-9-20(10-8-14)13-16-1-2-16/h3-6,14,16H,1-2,7-11,13H2
>1.00E+4n/an/an/an/an/an/an/an/a
Du Pont Merck Pharmaceutical Company
Curated by ChEMBL
Assay Description
The compound was tested in vitro for its binding affinity towards dopamine receptor D1
J Med Chem 35: 4344-61 (1992)
BindingDB Entry DOI: 10.7270/Q28P614G
D(2) dopamine receptor
(Mus musculus (Mouse))
BDBM50002245
(4-[2-(1-Cyclopropylmethyl-piperidin-4-yl)-acetyl]-...)
Show SMILES O=C(CC1CCN(CC2CC2)CC1)c1ccc(cc1)C#N
Show InChI InChI=1S/C18H22N2O/c19-12-15-3-5-17(6-4-15)18(21)11-14-7-9-20(10-8-14)13-16-1-2-16/h3-6,14,16H,1-2,7-11,13H2
n/an/a>1.00E+4n/an/an/an/an/an/a
Du Pont Merck Pharmaceutical Company
Curated by ChEMBL
Assay Description
In vitro binding affinity towards dopamine receptor D2
J Med Chem 35: 4344-61 (1992)
BindingDB Entry DOI: 10.7270/Q28P614G