BDBM50002458 1,3-Diethyl-2-[3-(1,3,3-trimethyl-1,3-dihydro-indol-2-ylidene)-propenyl]-3H-naphtho[2,3-d]imidazol-1-ium; chloride::CHEMBL23682
SMILES: CCn1c(\C=C\C=C2/N(C)c3ccccc3C2(C)C)[n+](CC)c2cc3ccccc3cc12
InChI Key: InChIKey=JPZCKKITRYQVME-UHFFFAOYSA-N
Data: 1 IC50
Activity Spreadsheet -- Enzyme Inhibition Constant Data from BindingDB
Found 1 hit for monomerid = 50002458
Trg + Lig
Ki
nM
ΔG°
kcal/mole
IC50
nM
Kd
nM
EC50/IC50
nM
koff
s-1
kon
M-1s-1
pHTemp
°C
Neurokinin 1 receptor
(Rattus norvegicus (rat))
BDBM50002458
(1,3-Diethyl-2-[3-(1,3,3-trimethyl-1,3-dihydro-indo...)
Show SMILES CCn1c(\C=C\C=C2/N(C)c3ccccc3C2(C)C)[n+](CC)c2cc3ccccc3cc12
Show InChI InChI=1S/C29H32N3/c1-6-31-25-19-21-13-8-9-14-22(21)20-26(25)32(7-2)28(31)18-12-17-27-29(3,4)23-15-10-11-16-24(23)30(27)5/h8-20H,6-7H2,1-5H3/q+1
Reactome pathway
n/an/a 390n/an/an/an/an/an/a
Rochester
Curated by ChEMBL
Assay Description
Inhibition of Tachykinin receptor 1 of rat forebrain tissue
J Med Chem 35: 1273-9 (1992)
BindingDB Entry DOI: 10.7270/Q2222SQM