BDBM50002654 (2-Benzhydryl-1-aza-bicyclo[2.2.2]oct-3-yl)-(2-ethoxy-benzyl)-amine::CHEMBL89652
SMILES: CCOc1ccccc1CN[C@H]1C2CCN(CC2)[C@H]1C(c1ccccc1)c1ccccc1
InChI Key: InChIKey=GPUOQABHPXXQED-VMPREFPWSA-N
Data: 1 IC50
Activity Spreadsheet -- Enzyme Inhibition Constant Data from BindingDB
Found 1 hit for monomerid = 50002654
Trg + Lig
Ki
nM
ΔG°
kcal/mole
IC50
nM
Kd
nM
EC50/IC50
nM
koff
s-1
kon
M-1s-1
pHTemp
°C
Neurokinin 1 receptor
(Homo sapiens (Human))
BDBM50002654
((2-Benzhydryl-1-aza-bicyclo[2.2.2]oct-3-yl)-(2-eth...)
Show SMILES CCOc1ccccc1CN[C@H]1C2CCN(CC2)[C@H]1C(c1ccccc1)c1ccccc1 |wD:11.11,18.21,(1.66,-3.62,;2.99,-4.39,;2.99,-5.93,;4.32,-6.7,;5.65,-5.93,;7,-6.7,;6.98,-8.24,;5.65,-9.01,;4.32,-8.22,;2.99,-8.99,;2.99,-10.53,;1.66,-11.3,;.33,-10.53,;-1,-11.3,;-1,-12.84,;.33,-13.61,;-.25,-12.62,;1.08,-11.86,;1.66,-12.84,;2.99,-13.61,;4.53,-13.61,;5.3,-14.94,;6.84,-14.94,;7.61,-13.61,;6.82,-12.28,;5.28,-12.28,;2.99,-15.15,;4.32,-15.92,;4.32,-17.46,;2.99,-18.23,;1.64,-17.46,;1.64,-15.92,)|
Show InChI InChI=1S/C29H34N2O/c1-2-32-26-16-10-9-15-25(26)21-30-28-24-17-19-31(20-18-24)29(28)27(22-11-5-3-6-12-22)23-13-7-4-8-14-23/h3-16,24,27-30H,2,17-21H2,1H3/t28-,29-/m0/s1
Reactome pathway
n/an/a 16n/an/an/an/an/an/a
Pfizer, Inc.
Curated by ChEMBL
Assay Description
Binding affinity towards Tachykinin receptor 1 in human IM-9 cells using [3H]-substance P as ligand
J Med Chem 35: 2591-600 (1992)
BindingDB Entry DOI: 10.7270/Q2SJ1JJF