BDBM50003163 (S)-1-((6R,7S)-3-Acetoxymethyl-7-methoxy-5,5,8-trioxo-5lambda*6*-thia-1-aza-bicyclo[4.2.0]oct-2-ene-2-carbonyl)-pyrrolidine-2-carboxylic acid::1-(3-Acetoxymethyl-7-methoxy-5,5,8-trioxo-5lambda*6*-thia-1-aza-bicyclo[4.2.0]oct-2-ene-2-carbonyl)-pyrrolidine-2-carboxylic acid::1-(3-Acetoxymethyl-7-methoxy-5,5,8-trioxo-5lambda*6*-thia-1-aza-bicyclo[4.2.0]oct-2-ene-2-carbonyl)-pyrrolidine-2-carboxylic acid (L-658758)::1-(3-Acetoxymethyl-7-methoxy-5,5,8-trioxo-5lambda*6*-thia-1-aza-bicyclo[4.2.0]oct-2-ene-2-carbonyl)-pyrrolidine-2-carboxylic acid(L-658,758)::CHEMBL446371::L-658758
SMILES: CO[C@@H]1[C@@H]2N(C1=O)C(C(=O)N1CCCC1C(O)=O)=C(COC(C)=O)CS2(=O)=O
InChI Key: InChIKey=SMZXYXKZTNLAKY-PMPKIWSKSA-N
Data: 1 KI  1 Kon
Activity Spreadsheet -- Enzyme Inhibition Constant Data from BindingDB
Found 2 hits for monomerid = 50003163
Trg + Lig
Ki
nM
ΔG°
kcal/mole
IC50
nM
Kd
nM
EC50/IC50
nM
koff
s-1
kon
M-1s-1
pHTemp
°C
Neutrophil elastase
(Homo sapiens (Human))
BDBM50003163
((S)-1-((6R,7S)-3-Acetoxymethyl-7-methoxy-5,5,8-tri...)
Show SMILES CO[C@@H]1[C@@H]2N(C1=O)C(C(=O)N1CCCC1C(O)=O)=C(COC(C)=O)CS2(=O)=O |t:19|
Show InChI InChI=1S/C16H20N2O9S/c1-8(19)27-6-9-7-28(24,25)15-12(26-2)14(21)18(15)11(9)13(20)17-5-3-4-10(17)16(22)23/h10,12,15H,3-7H2,1-2H3,(H,22,23)/t10?,12-,15+/m0/s1
Reactome pathway
2.20n/an/an/an/an/an/an/an/a
TBA
Curated by ChEMBL
Assay Description
Binding affinity for human leukocyte elastase (HLE); Kreact/Kinact
Bioorg Med Chem Lett 5: 319-324 (1995)
Article DOI: 10.1016/0960-894X(95)00028-R
BindingDB Entry DOI: 10.7270/Q22F7NDM
Neutrophil elastase
(Homo sapiens (Human))
BDBM50003163
((S)-1-((6R,7S)-3-Acetoxymethyl-7-methoxy-5,5,8-tri...)
Show SMILES CO[C@@H]1[C@@H]2N(C1=O)C(C(=O)N1CCCC1C(O)=O)=C(COC(C)=O)CS2(=O)=O |t:19|
Show InChI InChI=1S/C16H20N2O9S/c1-8(19)27-6-9-7-28(24,25)15-12(26-2)14(21)18(15)11(9)13(20)17-5-3-4-10(17)16(22)23/h10,12,15H,3-7H2,1-2H3,(H,22,23)/t10?,12-,15+/m0/s1
Reactome pathway
n/an/an/an/an/an/a 1.80E+3n/an/a
Pharmacia Farmitalia Carlo Erba
Curated by ChEMBL
Assay Description
Tested for the rate constant against Human Leukocyte Elastase (HLE) inactivation
J Med Chem 37: 4003-19 (1994)
BindingDB Entry DOI: 10.7270/Q2T43S5B