BDBM50003336 CHEMBL3234565
SMILES: CN1CCN(CC1)c1cc(nc(n1)N1CCC[C@H](C1)C(=O)NCCc1ccc(cc1)C#N)C(F)(F)F
InChI Key: InChIKey=VXHHIPNHNBMMJV-HXUWFJFHSA-N
Data: 2 IC50  2 EC50
Activity Spreadsheet -- Enzyme Inhibition Constant Data from BindingDB
Found 4 hits for monomerid = 50003336
Trg + Lig
Ki
nM
ΔG°
kcal/mole
IC50
nM
Kd
nM
EC50/IC50
nM
koff
s-1
kon
M-1s-1
pHTemp
°C
G-protein coupled bile acid receptor 1
(Mus musculus)
BDBM50003336
(CHEMBL3234565)
Show SMILES CN1CCN(CC1)c1cc(nc(n1)N1CCC[C@H](C1)C(=O)NCCc1ccc(cc1)C#N)C(F)(F)F |r|
Show InChI InChI=1S/C25H30F3N7O/c1-33-11-13-34(14-12-33)22-15-21(25(26,27)28)31-24(32-22)35-10-2-3-20(17-35)23(36)30-9-8-18-4-6-19(16-29)7-5-18/h4-7,15,20H,2-3,8-14,17H2,1H3,(H,30,36)/t20-/m1/s1
Reactome pathway
n/an/an/an/a 3n/an/an/an/a
Genomics Institute of the Novartis Research Foundation
Curated by ChEMBL
Assay Description
Agonist activity at mouse TGR5 expressed in Jurkat cells assessed as intracellular cAMP level after 1 hr by HTRF assay
J Med Chem 57: 3263-82 (2014)
Article DOI: 10.1021/jm401731q
BindingDB Entry DOI: 10.7270/Q2H41SZ3
G-protein coupled bile acid receptor 1
(Homo sapiens (Human))
BDBM50003336
(CHEMBL3234565)
Show SMILES CN1CCN(CC1)c1cc(nc(n1)N1CCC[C@H](C1)C(=O)NCCc1ccc(cc1)C#N)C(F)(F)F |r|
Show InChI InChI=1S/C25H30F3N7O/c1-33-11-13-34(14-12-33)22-15-21(25(26,27)28)31-24(32-22)35-10-2-3-20(17-35)23(36)30-9-8-18-4-6-19(16-29)7-5-18/h4-7,15,20H,2-3,8-14,17H2,1H3,(H,30,36)/t20-/m1/s1
Reactome pathway
n/an/an/an/a 2n/an/an/an/a
Genomics Institute of the Novartis Research Foundation
Curated by ChEMBL
Assay Description
Agonist activity at human TGR5 expressed in Jurkat cells assessed as intracellular cAMP level after 1 hr by HTRF assay
J Med Chem 57: 3263-82 (2014)
Article DOI: 10.1021/jm401731q
BindingDB Entry DOI: 10.7270/Q2H41SZ3
Transcriptional regulator ERG
(Homo sapiens (Human))
BDBM50003336
(CHEMBL3234565)
Show SMILES CN1CCN(CC1)c1cc(nc(n1)N1CCC[C@H](C1)C(=O)NCCc1ccc(cc1)C#N)C(F)(F)F |r|
Show InChI InChI=1S/C25H30F3N7O/c1-33-11-13-34(14-12-33)22-15-21(25(26,27)28)31-24(32-22)35-10-2-3-20(17-35)23(36)30-9-8-18-4-6-19(16-29)7-5-18/h4-7,15,20H,2-3,8-14,17H2,1H3,(H,30,36)/t20-/m1/s1
n/an/a 2.10E+3n/an/an/an/an/an/a
Genomics Institute of the Novartis Research Foundation
Curated by ChEMBL
Assay Description
Inhibition of human ERG by patch clamp method
J Med Chem 57: 3263-82 (2014)
Article DOI: 10.1021/jm401731q
BindingDB Entry DOI: 10.7270/Q2H41SZ3
Cytochrome P450 3A4
(Homo sapiens (Human))
BDBM50003336
(CHEMBL3234565)
Show SMILES CN1CCN(CC1)c1cc(nc(n1)N1CCC[C@H](C1)C(=O)NCCc1ccc(cc1)C#N)C(F)(F)F |r|
Show InChI InChI=1S/C25H30F3N7O/c1-33-11-13-34(14-12-33)22-15-21(25(26,27)28)31-24(32-22)35-10-2-3-20(17-35)23(36)30-9-8-18-4-6-19(16-29)7-5-18/h4-7,15,20H,2-3,8-14,17H2,1H3,(H,30,36)/t20-/m1/s1
Reactome pathway
n/an/a 2.00E+3n/an/an/an/an/an/a
Genomics Institute of the Novartis Research Foundation
Curated by ChEMBL
Assay Description
Inhibition of CYP3A4 (unknown origin)
J Med Chem 57: 3263-82 (2014)
Article DOI: 10.1021/jm401731q
BindingDB Entry DOI: 10.7270/Q2H41SZ3