BDBM50003416 3-(Hydroxy-phenyl-amino)-1-naphthalen-2-yl-propenone::CHEMBL335270
SMILES: ON(\C=C/C(=O)c1ccc2ccccc2c1)c1ccccc1
InChI Key: InChIKey=MVTCCYCMYIOOPQ-SEYXRHQNSA-N
Data: 1 IC50
Activity Spreadsheet -- Enzyme Inhibition Constant Data from BindingDB
Found 1 hit for monomerid = 50003416
Trg + Lig
Ki
nM
ΔG°
kcal/mole
IC50
nM
Kd
nM
EC50/IC50
nM
koff
s-1
kon
M-1s-1
pHTemp
°C
Arachidonate 5-lipoxygenase
(Rattus norvegicus)
BDBM50003416
(3-(Hydroxy-phenyl-amino)-1-naphthalen-2-yl-propeno...)
Show SMILES ON(\C=C/C(=O)c1ccc2ccccc2c1)c1ccccc1
Show InChI InChI=1S/C19H15NO2/c21-19(12-13-20(22)18-8-2-1-3-9-18)17-11-10-15-6-4-5-7-16(15)14-17/h1-14,22H/b13-12-
n/an/a 810n/an/an/an/an/an/a
Du Pont Merck Pharmaceutical Company
Curated by ChEMBL
Assay Description
inhibitory activity against 5-lipoxygenase in rat basophilic leukemia cell line.
J Med Chem 35: 4061-8 (1992)
BindingDB Entry DOI: 10.7270/Q2BC3XHJ