BDBM50003640 CHEMBL489625
SMILES: [Br-].OC(c1cccc(F)c1)(c1cccc(F)c1)C12CC[N+](CCOCc3ccccc3)(CC1)CC2
InChI Key: InChIKey=FTFQOHPIVJFSFN-UHFFFAOYSA-M
Data: 1 IC50
Activity Spreadsheet -- Enzyme Inhibition Constant Data from BindingDB
Found 1 hit for monomerid = 50003640
Trg + Lig
Ki
nM
ΔG°
kcal/mole
IC50
nM
Kd
nM
EC50/IC50
nM
koff
s-1
kon
M-1s-1
pHTemp
°C
Muscarinic acetylcholine receptor M3
(Homo sapiens (Human))
BDBM50003640
(CHEMBL489625)
Show SMILES [Br-].OC(c1cccc(F)c1)(c1cccc(F)c1)C12CC[N+](CCOCc3ccccc3)(CC1)CC2
Show InChI InChI=1S/C29H32F2NO2.BrH/c30-26-10-4-8-24(20-26)29(33,25-9-5-11-27(31)21-25)28-12-15-32(16-13-28,17-14-28)18-19-34-22-23-6-2-1-3-7-23;/h1-11,20-21,33H,12-19,22H2;1H/q+1;/p-1
Reactome pathway
n/an/a<1.00E+4n/an/an/an/an/an/a
GlaxoSmithKline
Curated by ChEMBL
Assay Description
Antagonist activity at human cloned muscarinic M3 receptor expressed in CHO cells assessed as inhibition of acetylcholine-induced calcium mobilizatio...
J Med Chem 52: 2493-505 (2009)
Article DOI: 10.1021/jm801601v
BindingDB Entry DOI: 10.7270/Q2H131X8