null
SMILES: Clc1ccc2c(NCCNC(=S)Nc3ccccc3)ccnc2c1
InChI Key: InChIKey=IJXCQAXQOXFBCA-UHFFFAOYSA-N
Activity Spreadsheet -- Enzyme Inhibition Constant Data from BindingDB
Found 1 hit for monomerid = 50003651
Trg + Lig
Ki
nM
ΔG°
kcal/mole
IC50
nM
Kd
nM
EC50/IC50
nM
koff
s-1
kon
M-1s-1
pHTemp
°C
Histidine-rich protein PFHRP-II
(Plasmodium falciparum)
BDBM50003651
(CHEMBL443507)
Show SMILES Clc1ccc2c(NCCNC(=S)Nc3ccccc3)ccnc2c1
Show InChI InChI=1S/C18H17ClN4S/c19-13-6-7-15-16(8-9-20-17(15)12-13)21-10-11-22-18(24)23-14-4-2-1-3-5-14/h1-9,12H,10-11H2,(H,20,21)(H2,22,23,24)
n/an/a 9.90n/an/an/an/an/an/a
Central Drug Research Institute
Curated by ChEMBL
Assay Description
Antiplasmodial activity as inhibition of beta-hematin against Plasmodium yoelii N67 infected Swiss mice (Mus musculus) erythrocytes
Bioorg Med Chem Lett 19: 2570-3 (2009)
Article DOI: 10.1016/j.bmcl.2009.03.026
BindingDB Entry DOI: 10.7270/Q2JD4Z8D