null
SMILES: Clc1ccc2c(NCCN3\C(SC(=O)C3=O)=N\c3ccccc3)ccnc2c1
InChI Key: InChIKey=VVHFLWAINGKVJW-GFMRDNFCSA-N
Activity Spreadsheet -- Enzyme Inhibition Constant Data from BindingDB
Found 1 hit for monomerid = 50003671
Trg + Lig
Ki
nM
ΔG°
kcal/mole
IC50
nM
Kd
nM
EC50/IC50
nM
koff
s-1
kon
M-1s-1
pHTemp
°C
Histidine-rich protein PFHRP-II
(Plasmodium falciparum)
BDBM50003671
(CHEMBL466911)
Show SMILES Clc1ccc2c(NCCN3\C(SC(=O)C3=O)=N\c3ccccc3)ccnc2c1
Show InChI InChI=1S/C20H15ClN4O2S/c21-13-6-7-15-16(8-9-22-17(15)12-13)23-10-11-25-18(26)19(27)28-20(25)24-14-4-2-1-3-5-14/h1-9,12H,10-11H2,(H,22,23)/b24-20-
n/an/a 9.80n/an/an/an/an/an/a
Central Drug Research Institute
Curated by ChEMBL
Assay Description
Antiplasmodial activity as inhibition of beta-hematin against Plasmodium yoelii N67 infected Swiss mice (Mus musculus) erythrocytes
Bioorg Med Chem Lett 19: 2570-3 (2009)
Article DOI: 10.1016/j.bmcl.2009.03.026
BindingDB Entry DOI: 10.7270/Q2JD4Z8D