BDBM50003862 CHEMBL3235319
SMILES: CC1(C)Oc2ncnc(N)c2N=C1c1ccc(cc1)[C@H]1CC[C@H](Cc2nnn[nH]2)CC1
InChI Key: InChIKey=GTDBUNVIFMFNEX-HDJSIYSDSA-N
Data: 2 IC50
Activity Spreadsheet -- Enzyme Inhibition Constant Data from BindingDB
Found 2 hits for monomerid = 50003862
Trg + Lig
Ki
nM
ΔG°
kcal/mole
IC50
nM
Kd
nM
EC50/IC50
nM
koff
s-1
kon
M-1s-1
pHTemp
°C
Diacylglycerol O-acyltransferase 1
(Homo sapiens (Human))
BDBM50003862
(CHEMBL3235319)
Show SMILES CC1(C)Oc2ncnc(N)c2N=C1c1ccc(cc1)[C@H]1CC[C@H](Cc2nnn[nH]2)CC1 |r,wU:19.21,wD:22.25,c:12,(58.66,-9.38,;57.12,-9.38,;57.89,-10.71,;55.79,-10.16,;54.46,-9.39,;53.12,-10.17,;51.79,-9.4,;51.79,-7.86,;53.12,-7.08,;53.11,-5.54,;54.45,-7.85,;55.78,-7.08,;57.12,-7.84,;58.45,-7.06,;59.78,-7.83,;61.11,-7.05,;61.1,-5.51,;59.75,-4.75,;58.43,-5.53,;62.43,-4.73,;62.4,-3.19,;63.74,-2.41,;65.08,-3.18,;66.41,-2.4,;67.75,-3.17,;69.14,-2.53,;70.18,-3.67,;69.41,-5.01,;67.9,-4.7,;65.08,-4.72,;63.76,-5.49,)|
Show InChI InChI=1S/C22H26N8O/c1-22(2)19(26-18-20(23)24-12-25-21(18)31-22)16-9-7-15(8-10-16)14-5-3-13(4-6-14)11-17-27-29-30-28-17/h7-10,12-14H,3-6,11H2,1-2H3,(H2,23,24,25)(H,27,28,29,30)/t13-,14-
n/an/a 2.50E+3n/an/an/an/an/an/a
Amgen Inc.
Curated by ChEMBL
Assay Description
Inhibition of DGAT1 (unknown origin) by cell-based assay
J Med Chem 57: 3464-83 (2014)
Article DOI: 10.1021/jm500135c
BindingDB Entry DOI: 10.7270/Q23X886W
Diacylglycerol O-acyltransferase 1
(Homo sapiens (Human))
BDBM50003862
(CHEMBL3235319)
Show SMILES CC1(C)Oc2ncnc(N)c2N=C1c1ccc(cc1)[C@H]1CC[C@H](Cc2nnn[nH]2)CC1 |r,wU:19.21,wD:22.25,c:12,(58.66,-9.38,;57.12,-9.38,;57.89,-10.71,;55.79,-10.16,;54.46,-9.39,;53.12,-10.17,;51.79,-9.4,;51.79,-7.86,;53.12,-7.08,;53.11,-5.54,;54.45,-7.85,;55.78,-7.08,;57.12,-7.84,;58.45,-7.06,;59.78,-7.83,;61.11,-7.05,;61.1,-5.51,;59.75,-4.75,;58.43,-5.53,;62.43,-4.73,;62.4,-3.19,;63.74,-2.41,;65.08,-3.18,;66.41,-2.4,;67.75,-3.17,;69.14,-2.53,;70.18,-3.67,;69.41,-5.01,;67.9,-4.7,;65.08,-4.72,;63.76,-5.49,)|
Show InChI InChI=1S/C22H26N8O/c1-22(2)19(26-18-20(23)24-12-25-21(18)31-22)16-9-7-15(8-10-16)14-5-3-13(4-6-14)11-17-27-29-30-28-17/h7-10,12-14H,3-6,11H2,1-2H3,(H2,23,24,25)(H,27,28,29,30)/t13-,14-
n/an/a 7n/an/an/an/an/an/a
Amgen Inc.
Curated by ChEMBL
Assay Description
Inhibition of human liver flag-tagged DGAT1 expressed in baculovirus infected insect cells after 2 hrs by SPA
J Med Chem 57: 3464-83 (2014)
Article DOI: 10.1021/jm500135c
BindingDB Entry DOI: 10.7270/Q23X886W