BDBM50004007 2-[2-(1-Benzyl-piperidin-4-yl)-ethyl]-1,3-dioxo-2,3-dihydro-1H-isoindole-5-carboxylic acid benzylamide::CHEMBL140228
SMILES: O=C(NCc1ccccc1)c1ccc2C(=O)N(CCC3CCN(Cc4ccccc4)CC3)C(=O)c2c1
InChI Key: InChIKey=QGAPVVCNCHLBSF-UHFFFAOYSA-N
Data: 1 IC50
Activity Spreadsheet -- Enzyme Inhibition Constant Data from BindingDB
Found 1 hit for monomerid = 50004007
Trg + Lig
Ki
nM
ΔG°
kcal/mole
IC50
nM
Kd
nM
EC50/IC50
nM
koff
s-1
kon
M-1s-1
pHTemp
°C
Acetylcholinesterase
(Mus musculus (mouse))
BDBM50004007
(2-[2-(1-Benzyl-piperidin-4-yl)-ethyl]-1,3-dioxo-2,...)
Show SMILES O=C(NCc1ccccc1)c1ccc2C(=O)N(CCC3CCN(Cc4ccccc4)CC3)C(=O)c2c1
Show InChI InChI=1S/C30H31N3O3/c34-28(31-20-23-7-3-1-4-8-23)25-11-12-26-27(19-25)30(36)33(29(26)35)18-15-22-13-16-32(17-14-22)21-24-9-5-2-6-10-24/h1-12,19,22H,13-18,20-21H2,(H,31,34)
Reactome pathway
n/an/a 2.20n/an/an/an/an/an/a
Eisai Co., Ltd.
Curated by ChEMBL
Assay Description
In vitro inhibitory concentration against acetylcholinesterase (AChE) obtained from mouse brain homogenate.
J Med Chem 35: 4542-8 (1993)
BindingDB Entry DOI: 10.7270/Q25M64P8