BDBM50004116 1-Cyclohexyloxymethyl-5-ethyl-6-phenylsulfanyl-1H-pyrimidine-2,4-dione::CHEMBL343948
SMILES: CCc1c(Sc2ccccc2)n(COC2CCCCC2)c(=O)[nH]c1=O
InChI Key: InChIKey=DBMJTBUJNVLYTP-UHFFFAOYSA-N
Data: 1 EC50
Activity Spreadsheet -- Enzyme Inhibition Constant Data from BindingDB
Found 1 hit for monomerid = 50004116
Trg + Lig
Ki
nM
ΔG°
kcal/mole
IC50
nM
Kd
nM
EC50/IC50
nM
koff
s-1
kon
M-1s-1
pHTemp
°C
Human immunodeficiency virus type 1 reverse transcriptase
(Human immunodeficiency virus 1)
BDBM50004116
(1-Cyclohexyloxymethyl-5-ethyl-6-phenylsulfanyl-1H-...)
Show SMILES CCc1c(Sc2ccccc2)n(COC2CCCCC2)c(=O)[nH]c1=O
Show InChI InChI=1S/C19H24N2O3S/c1-2-16-17(22)20-19(23)21(13-24-14-9-5-3-6-10-14)18(16)25-15-11-7-4-8-12-15/h4,7-8,11-12,14H,2-3,5-6,9-10,13H2,1H3,(H,20,22,23)
n/an/an/an/a 4.00E+3n/an/an/an/a
Université d'Orléans
Curated by ChEMBL
Assay Description
Inhibitory concentration against HIV-1 reverse transcriptase
J Med Chem 40: 4257-64 (1998)
Article DOI: 10.1021/jm970110p
BindingDB Entry DOI: 10.7270/Q2WS8SC3