BDBM50004125 6-(3,5-Dichloro-phenylsulfanyl)-1-ethoxymethyl-5-ethyl-2-thioxo-2,3-dihydro-1H-pyrimidin-4-one::CHEMBL340049
SMILES: CCOCn1c(Sc2cc(Cl)cc(Cl)c2)c(CC)c(=O)[nH]c1=S
InChI Key: InChIKey=ADCROGVPITZTOS-UHFFFAOYSA-N
Data: 1 EC50
Activity Spreadsheet -- Enzyme Inhibition Constant Data from BindingDB
Found 1 hit for monomerid = 50004125
Trg + Lig
Ki
nM
ΔG°
kcal/mole
IC50
nM
Kd
nM
EC50/IC50
nM
koff
s-1
kon
M-1s-1
pHTemp
°C
Human immunodeficiency virus type 1 reverse transcriptase
(Human immunodeficiency virus 1)
BDBM50004125
(6-(3,5-Dichloro-phenylsulfanyl)-1-ethoxymethyl-5-e...)
Show SMILES CCOCn1c(Sc2cc(Cl)cc(Cl)c2)c(CC)c(=O)[nH]c1=S
Show InChI InChI=1S/C15H16Cl2N2O2S2/c1-3-12-13(20)18-15(22)19(8-21-4-2)14(12)23-11-6-9(16)5-10(17)7-11/h5-7H,3-4,8H2,1-2H3,(H,18,20,22)
n/an/an/an/a 13n/an/an/an/a
Université d'Orléans
Curated by ChEMBL
Assay Description
Inhibitory concentration against HIV-1 reverse transcriptase
J Med Chem 40: 4257-64 (1998)
Article DOI: 10.1021/jm970110p
BindingDB Entry DOI: 10.7270/Q2WS8SC3