BDBM50004149 5-Ethyl-1-phenethyloxymethyl-6-phenylsulfanyl-2-thioxo-2,3-dihydro-1H-pyrimidin-4-one::CHEMBL135277
SMILES: CCc1c(Sc2ccccc2)n(COCCc2ccccc2)c(=S)[nH]c1=O
InChI Key: InChIKey=MZJWOKFMVOMROJ-UHFFFAOYSA-N
Data: 1 EC50
Activity Spreadsheet -- Enzyme Inhibition Constant Data from BindingDB
Found 1 hit for monomerid = 50004149
Trg + Lig
Ki
nM
ΔG°
kcal/mole
IC50
nM
Kd
nM
EC50/IC50
nM
koff
s-1
kon
M-1s-1
pHTemp
°C
Human immunodeficiency virus type 1 reverse transcriptase
(Human immunodeficiency virus 1)
BDBM50004149
(5-Ethyl-1-phenethyloxymethyl-6-phenylsulfanyl-2-th...)
Show SMILES CCc1c(Sc2ccccc2)n(COCCc2ccccc2)c(=S)[nH]c1=O
Show InChI InChI=1S/C21H22N2O2S2/c1-2-18-19(24)22-21(26)23(20(18)27-17-11-7-4-8-12-17)15-25-14-13-16-9-5-3-6-10-16/h3-12H,2,13-15H2,1H3,(H,22,24,26)
n/an/an/an/a 91n/an/an/an/a
Université d'Orléans
Curated by ChEMBL
Assay Description
Inhibitory concentration against HIV-1 reverse transcriptase
J Med Chem 40: 4257-64 (1998)
Article DOI: 10.1021/jm970110p
BindingDB Entry DOI: 10.7270/Q2WS8SC3