BDBM50004225 CHEMBL3237190
SMILES: CN1CCN(CC1)c1cc(Nc2cc(C)[nH]n2)nc(Nc2ccc(cc2)N2CCOCC2)n1
InChI Key: InChIKey=KWXSJRRBFUMJAN-UHFFFAOYSA-N
Data: 1 IC50
Activity Spreadsheet -- Enzyme Inhibition Constant Data from BindingDB
Found 1 hit for monomerid = 50004225
Trg + Lig
Ki
nM
ΔG°
kcal/mole
IC50
nM
Kd
nM
EC50/IC50
nM
koff
s-1
kon
M-1s-1
pHTemp
°C
Aurora kinase A
(Homo sapiens (Human))
BDBM50004225
(CHEMBL3237190)
Show SMILES CN1CCN(CC1)c1cc(Nc2cc(C)[nH]n2)nc(Nc2ccc(cc2)N2CCOCC2)n1
Show InChI InChI=1S/C23H31N9O/c1-17-15-21(29-28-17)25-20-16-22(32-9-7-30(2)8-10-32)27-23(26-20)24-18-3-5-19(6-4-18)31-11-13-33-14-12-31/h3-6,15-16H,7-14H2,1-2H3,(H3,24,25,26,27,28,29)
NCI pathway
Reactome pathway
n/an/a 112n/an/an/an/an/an/a
Sun Yat-sen University
Curated by ChEMBL
Assay Description
Inhibition of Aurora A (unknown origin) using FAM-labeled peptide as substrate preincubated for 10 mins followed by substrate addition measured after...
Eur J Med Chem 78: 65-71 (2014)
Article DOI: 10.1016/j.ejmech.2014.03.027
BindingDB Entry DOI: 10.7270/Q2Z60QKP