BDBM50004254 CHEMBL3237495
SMILES: NS(=O)(=O)c1cccc(NC(=S)NC(=O)c2ccc(Cl)cc2Cl)c1
InChI Key: InChIKey=ZJQFBQHCTDDCKX-UHFFFAOYSA-N
Data: 1 IC50
Activity Spreadsheet -- Enzyme Inhibition Constant Data from BindingDB
Found 1 hit for monomerid = 50004254
Trg + Lig
Ki
nM
ΔG°
kcal/mole
IC50
nM
Kd
nM
EC50/IC50
nM
koff
s-1
kon
M-1s-1
pHTemp
°C
Carbonic anhydrase
(Bos taurus)
BDBM50004254
(CHEMBL3237495)
Show SMILES NS(=O)(=O)c1cccc(NC(=S)NC(=O)c2ccc(Cl)cc2Cl)c1
Show InChI InChI=1S/C14H11Cl2N3O3S2/c15-8-4-5-11(12(16)6-8)13(20)19-14(23)18-9-2-1-3-10(7-9)24(17,21)22/h1-7H,(H2,17,21,22)(H2,18,19,20,23)
n/an/a 1.71E+4n/an/an/an/an/an/a
COMSATS Institute of Information Technology
Curated by ChEMBL
Assay Description
Inhibition of bovine erythrocyte carbonic anhydrase 2 using p-nitrophenyl acetate as substrate preincubated for 10 mins before substrate addition mea...
Eur J Med Chem 78: 140-50 (2014)
Article DOI: 10.1016/j.ejmech.2014.03.023
BindingDB Entry DOI: 10.7270/Q2PN975X